Id,Candidate,"E-Mail Address","Application date / time","Latest Source","Address Line 1",County,Postcode,"Mobile Number","Home Phone Number",Industry,"Contract / Job Type Required","Current Status","Available Date","Current Employer","Current Job Title","Attachment URL"
344258945,"Judith song",nobody1cm@yahoo.com,2021-04-02T22:43:02,cvlibrary,,,,,,"Social Care",Contract,,,"Older Adults Community Mental Health Team","Social Worker",s3://attachments.broadbean.com/344258945
378082339,"Rui Martins",rui.martins@yahoo.com,2021-04-03T10:01:48,gojobsite,", Lisbon",,,,"+35 191 9923",,,,,Portugal,"National Campaigns Coordinator",s3://attachments.broadbean.com/378082339
378082201,"Walewska Bonneau",walewskabonneau@gmail.com,2021-04-03T09:59:53,reed,,,,"44 784 246 8167","3467 482 9019",,,,,"Lucas Fox International","International Agent",s3://attachments.broadbean.com/378082201
378082789,"Paul Barrett",pbarrett32@outlook.com,2021-04-03T10:10:02,gojobsite,"165 Otley Rd, Leeds, LS6 3QG","West Yorkshire","LS6 3QG","0776 986 7297",,,,,,,Lead,s3://attachments.broadbean.com/378082789
378081207,"Lucas Williamson",lucaswilliamson101@gmail.com,2021-04-03T09:43:09,eden_brown_public_sector,"4 Burns Avenue, NG7 4DR",Nottinghamshire,"NG7 4DR","0780 340 1712",,"Social Care",Temporary,,,,"Psychological Consultant",s3://attachments.broadbean.com/378081207
378108395,"Sarah Bentley",sb70036@gmail.com,2021-04-03T17:07:59,gojobsite,,,,"0799 996 2603",,"Education and Training",Temporary,,,,"Team Member",s3://attachments.broadbean.com/378108395
378101021,"Aarron Kjensberg",AarronKjensberg@hotmail.co.uk,2021-04-03T15:26:14,eden_brown_public_sector,Liverpool,,,,"0730 544 0018","Education and Training",Permanent,,,"Intelling - NHS Test & Trace",,s3://attachments.broadbean.com/378101021
284238445,"Amrita Kaur",amrita.kaur811@hotmail.co.uk,2021-04-03T15:01:28,gojobsite,"16 Marlborough close, RM16 2SU",Essex,"RM16 2SU","0750 741 3434",,"Social Care",Contract,,,"Kiran Support services","Victim Contact Officer",s3://attachments.broadbean.com/284238445
378101239,"Chackochi Thomas",thomaschackochy77@gmail.com,2021-04-03T15:17:48,gojobsite,"Hotel 10 Marash Road, The Pines, LU32NH",Bedfordshire,LU32NH,"0758 792 8279",,"Social Care",Temporary,,,"CERTIFIED NSS VOLUNTEER",ASSISTANT,s3://attachments.broadbean.com/378101239
375490903,"Vidyasagar Jadhyala",jandhyalavidyasagar82@gmail.com,2021-04-03T13:00:51,cvlibrary,"[, Image",,,"91 994 947 7761",,"Public Sector and Government",Temporary,,,"HSBC Software Development India Private Limited","Lead Business Analyst",s3://attachments.broadbean.com/375490903
114340241,"Casmir Obasi",casmirobasi@yahoo.co.uk,2021-04-04T13:23:52,cvlibrary,"*, London",Essex,"E17 7JP","0736 822 2537","0736 822 2537","Social Care",Contract,,,"London Borough of Barnet","Senior/Lead Social Worker",s3://attachments.broadbean.com/114340241
378204073,"Dr Pradeep S Raj",drpradeepsraj14@gmail.com,2021-04-05T05:39:16,eden_brown_public_sector,"Door.No.202 , St. George Square , 8th Cross, AshaTownship, Bileshivale, Doddagubbi P.O ., Bangalore",,,"+91 99947 03374",,"Education and Training",Temporary,,,,"Assistant Professor",s3://attachments.broadbean.com/378204073
378208093,"Umar Safdar",umarkiani@gmail.com,2021-04-05T06:50:06,gojobsite,"House # 92, Ali Block, Sector B, Bharia Town Lahor",,,"+92 321 8012358",,"Education and Training",Temporary,,,HEC,"Head of Department/Assistant professor",s3://attachments.broadbean.com/378208093
375561221,"Saba Deshmukh",sabadeshmukh.92@gmail.com,2021-04-05T09:18:12,gojobsite,"2 Haddon street, M6 6BN Salford, United Kingdom.",,,"0746 715 2865",,"Social Care",Contract,,,,,s3://attachments.broadbean.com/375561221
378193445,"BENJAMIN ROSS",43bendavid@gmail.com,2021-04-05T00:22:37,reed_premium,"43 CHAPEL HILL ROAD, MORETON, CH46 9QG",Merseyside,"CH46 9QG","0754 297 1747",,"Social Care",Contract,,,"Mint People",,s3://attachments.broadbean.com/378193445
378187415,"Umar Saeed",umar.saeed008@outlook.com,2021-04-04T21:22:17,gojobsite,"147 New Barnes avenue, Manchester, M21 7DG","Greater Manchester","M21 7DG","0756 103 2206",,"Social Care",Contract,,,Amazon,"Fulfilment Associate",s3://attachments.broadbean.com/378187415
367633485,"Ayodeji Akinfolarin",aa.akinfolarin@yahoo.co.uk,2021-04-04T21:38:19,cvlibrary,,,,"44 794 057 7441",,"Public Sector and Government",Temporary,,,,"Business Analyst",s3://attachments.broadbean.com/367633485
308938081,"Kathryn Nuttall",knuttall@apnutt.plus.com,2019-10-28T12:15:28,cvlibrary,":, Image, M29 7GH",Lancashire,"M29 7GH",,"0194 288 3453",,,,,,"Artist and Jewellery",s3://attachments.broadbean.com/308938081
308938403,"Michael Owst",unknown_email@reed-14061616-synergy.com,2019-10-28T12:17:38,reed,,,,,,,,,,"West Kent College",Lecturer,s3://attachments.broadbean.com/308938403
308931927,"Funmilayo Kolawole",tinufunmi147@yahoo.co.uk,2019-10-28T11:41:27,gojobsite,,,,,"0783 842 0001","Social Care",Contract,,,,"Support Worker",s3://attachments.broadbean.com/308931927
308981751,"Abigail Clarke-Roome",abi-2010@live.co.uk,2019-10-28T16:39:10,gojobsite,,,,,,"Recruitment Consultancy",Permanent,,,"Thomas Cook Airlines",,s3://attachments.broadbean.com/308981751
308989039,"Andrew Potter",andrew.potter@blueyonder.co.uk,2019-10-28T17:27:36,gojobsite,", Solihull, West Midlands",,,"0796 860 9620",,"Education and Training",Temporary,,,"Chamber of Commerce","IT Project Manager",s3://attachments.broadbean.com/308989039
308995957,"David Ivison",unknown_email@reed-27903725-synergy.com,2019-10-28T18:23:33,reed,,,,"0792 832 1775",,,,,,,Dates,s3://attachments.broadbean.com/308995957
309006335,"Haya Massad",h.massad7@gmail.com,2019-10-28T19:44:51,gojobsite,,,,"+970 599 046 692",,"Social Care",Contract,,,,,s3://attachments.broadbean.com/309006335
308990821,"Joshua Bedford",josh.bedford96@gmail.com,2019-10-28T17:42:10,eden_brown_public_sector,"10 Chestnut Path, Canewdon, Essex, SS4 3QQ",Essex,"SS4 3QQ","0744 677 6500",,"Public Sector and Government",Temporary,,,"Richardson Institute",,s3://attachments.broadbean.com/308990821
308989483,"Tian Jiang",tiansmyth@gmail.com,2019-10-28T17:31:10,eden_brown_public_sector,,,,"44 745 295 9128",,"Public Sector and Government",Temporary,,,"Milestone Group","Business Implementation Consultant",s3://attachments.broadbean.com/308989483
308985601,"Lewis Greengrass",lewisgreengrass@live.co.uk,2019-10-28T17:04:09,cvlibrary,"18 Sunderland Close, Carbrooke, Norfolk, IP25 6GR",Norfolk,"IP25 6GR","0782 551 8900",,"Public Sector and Government",Contract,,,"CVS UK Ltd","Purchase Ledger Clark",s3://attachments.broadbean.com/308985601
305358183,"Harpal Selhi",paulseli1960@virginmedia.com,2019-10-30T08:08:44,gojobsite,"24 Hartforde Rd, Borehamwood, Herts, WD6 5JU",Hertfordshire,"WD6 5JU","0759 783 4544","0208 207 3251","Education and Training",Contract,,,,"Fresh Produce Assistant / Customer Service Tesco Stores",s3://attachments.broadbean.com/305358183
309241363,"Jennifer Jacqueline Harris",jennifer.jacquelineharris@yahoo.com,2019-10-30T08:47:10,eden_brown_public_sector,"23 Castle Mead 232 Camberwell Road, LONDON, SE5 0EA",London,"SE5 0EA","0776 594 0361",,"Education and Training",Contract,,,,,s3://attachments.broadbean.com/309241363
309165275,"Vaishali Thanki",vaishali.thanki91@gmail.com,2019-10-29T18:25:31,cvlibrary,"5, Mill Croft Close, Norwich, NR5 0ST",Norfolk,"NR5 0ST","44 759 473 0559",,"Public Sector and Government",Contract,,,HSBC,"Customer Service Representative",s3://attachments.broadbean.com/309165275
309171755,"Abubaker Osman",abu-bakr2010@live.co.uk,2019-10-29T19:22:21,cvlibrary,,,,,,"Education and Training",Permanent,,,"Carlisle Security","Door Supervisor",s3://attachments.broadbean.com/309171755
309088743,"Lawrence Mathias",ljmathias@yahoo.co.uk,2019-10-29T10:07:20,eb_education,"112B Hindes Road, Harrow, Middx, HA1 1RP",London,"HA1 1RP","0749 128 4148","0208 424 9394","Education and Training",Contract,,,"Harrow Council/Transport for London/Wealdstone Active Community","Arts Co-ordinator",s3://attachments.broadbean.com/309088743
308965533,"Rafique Ahamed",ahamed.rafique@ymail.com,2019-10-28T14:59:14,cvlibrary,"27 Windsor House, Knottisford Street, Bethnal Green, London, E2 0RT",London,"E2 0RT","0794 811 9784","00 44 7 392 483 392","Public Sector and Government",Temporary,,,"Noya Bazar Ltd",Accountant,s3://attachments.broadbean.com/308965533
308977221,"Graham Endersby",gendersby@hotmail.com,2019-10-28T16:09:30,gojobsite,"61 Wrenthorpe Lane, Wakefield, WF2 0PX","West Yorkshire","WF2 0PX","0749 885 6814",,"Social Care",Contract,,,"Foundation Housing",Cleaner,s3://attachments.broadbean.com/308977221
309136607,"Olubiyi Akinsuyi",akinsuyi@outlook.com,2019-10-29T14:59:21,cvlibrary,,,,"0792 657 7434",,"Public Sector and Government",Temporary,,,"Regal Flavours Limited","Project Analyst",s3://attachments.broadbean.com/309136607
309253391,"Jenique Alman",jenique.alman@hotmail.com,2019-10-30T10:12:11,eb_education,,,,"0759 776 8745",,"Education and Training",Temporary,,,,"Private Tutor",s3://attachments.broadbean.com/309253391
309353715,"Shahida Hashmi",hashmi_shahida@yahoo.com,2019-10-30T15:04:07,gojobsite,,,,"0771 500 1420",,"Education and Training",Contract,,,"College of Haringey","Curriculum Manager",s3://attachments.broadbean.com/309353715
309363001,"Franklin Ifesanya",franklin@hotmail.co.uk,2019-10-30T15:28:10,eden_brown_public_sector,"80 Foss Avenue, London, CR0",,,,"0795 615 7281",Engineering,Permanent,,,"Employment Plus",,s3://attachments.broadbean.com/309363001
306552709,"Ashley Hargreaves",ashley_hargreaves@hotmail.co.uk,2019-10-10T11:10:12,eden_brown_public_sector,"19 Cheyne Gardens, Aigburth, L19 3PH",Merseyside,"L19 3PH","0754 438 2402","0151 280 8047","Social Care",Contract,,,"ADHD Foundation",,s3://attachments.broadbean.com/306552709
306575963,"Christopher. B. Ebiesuwa",infosanitev@gmail.com,2019-10-10T13:35:40,gojobsite,"78 Parkland Road, Wood Green, N22 6ST",London,"N22 6ST","0758 771 4325",,"Social Care",Contract,,,"IL Bantus. Co.operativa Sociale","Administrative/ Team Leader.Carer",s3://attachments.broadbean.com/306575963
306596597,"Julie Davison",julie.davison19@gmail.com,2019-10-10T15:48:31,reed,"26 Garside Grove, Peterlee, Co Durham, SR8 2QB","County Durham","SR8 2QB","0772 342 0874",,,,,,"Durham County Council Families First Team","Social Worker",s3://attachments.broadbean.com/306596597
306600953,"John McGovern",Johnmcgovernuk@yahoo.co.uk,2019-10-10T16:21:18,gojobsite,"143 Holcroft Court, Clipstone Street, London, W1W 5DN",London,"W1W 5DN","0739 815 2034","0207 631 3032","Social Care",Permanent,,,,"social worker",s3://attachments.broadbean.com/306600953
306578715,"Helen Dodds",helendodds@hotmail.co.uk,2019-10-10T13:51:26,cvlibrary,"Image, B927DU","West Midlands",B927DU,"0783 746 2048",,,,,,"Appel Farm Arts Camp",,s3://attachments.broadbean.com/306578715
306579759,"Zara Zaidi",zaidizara@hotmail.com,2019-10-10T13:58:58,cvlibrary,", Cheetham Hill",,,"44 787 356 8714",,,,,,"Fairhaven Young People's Unit","Science Teacher",s3://attachments.broadbean.com/306579759
306579325,"Adele Normington",adele_draper@hotmail.com,2019-10-10T13:55:48,cvlibrary,"Holly Cottage, 82 Liverpool Road, Rufford, Lancashire, L40 1SB",Lancashire,"L40 1SB","0758 104 4283",,,,,,,,s3://attachments.broadbean.com/306579325
306579611,"Nadeem Mansoor",NMANSOOR2019@GMAIL.COM,2019-10-10T13:57:41,gojobsite,"10 QUEENSWAY, DERBY, DE22 3BE",Derbyshire,"DE22 3BE","0752 263 1626",,"Recruitment Consultancy",Permanent,,,"Nadeem Mansoor Art",,s3://attachments.broadbean.com/306579611
306595891,"Heather Angus",heatherdangus@gmail.com,2019-10-10T15:44:11,eden_brown_public_sector,"39 Beecroft Way, Dunstable, Bedfordshire, LU61EE",Bedfordshire,LU61EE,"0790 281 9566",,"Education and Training",Permanent,,,"Art of Ooopdoop","Stall Coordinator",s3://attachments.broadbean.com/306595891
306829413,"Julie Line",julie.line@streamlinechangeconsulting.uk,2019-10-12T14:48:03,cvlibrary,"Corner, Lee Common, Great Missenden, Bucks, HP16 9LD",Buckinghamshire,"HP16 9LD","0790 991 2904",,"Social Care",Temporary,,,"British Council",,s3://attachments.broadbean.com/306829413
306821955,"Stephen Abrahams",stephen_david_abrahams23@hotmail.co.uk,2019-10-12T13:21:44,cvlibrary,":, Image, EN1 3SD",London,"EN1 3SD","0771 079 1653",,"Property and Housing",Permanent,,,"Britex International","Top Senior Unit Manager",s3://attachments.broadbean.com/306821955
306775439,"Hamza Nabi",hamza715@icloud.com,2019-10-12T20:57:11,eden_brown_public_sector,"44 Edith Road, Birmingham, West Midlands, B66 4QX","West Midlands","B66 4QX","0772 208 0773",,"Call Centre and Customer Service",Temporary,,,GoBack,,s3://attachments.broadbean.com/306775439
306516961,"Demitri Cuscito",demitricuscito@outlook.com,2019-10-10T07:22:50,cvlibrary,"[, Image",,,"0781 850 6313",,"Call Centre and Customer Service",Temporary,,,"Thomas Cook",,s3://attachments.broadbean.com/306516961
306450113,"Helen Odukoya",hodukoya@gmail.com,2019-10-09T18:30:22,gojobsite,London,,,"0793 147 4703",,"Education and Training",Contract,,,"EMF Consulting Ltd","Project Administrator / Data Entry",s3://attachments.broadbean.com/306450113
306453653,"William Close",billclose64@hotmail.com,2019-10-09T19:00:39,cvlibrary,":, Image, NE12 9SP","Tyne and Wear","NE12 9SP","0750 717 4461",,"Public Sector and Government",Contract,,,"NIDO STUDENT ACCOMODATION","INTERIM CITY MANAGER",s3://attachments.broadbean.com/306453653
305319481,"Alima Sadiya",alima_s1@hotmail.com,2019-10-09T23:30:30,gojobsite,"3 Eileen Road, Birmingham, B11 4HX","West Midlands","B11 4HX","0752 824 7888",,"Community Services",Contract,,,"Midlands Living LTD","Housing officer/Support Manager",s3://attachments.broadbean.com/305319481
306480663,"Chanel McLeod",chanelmcleod48@gmail.com,2019-10-09T23:43:12,eden_brown_public_sector,"51 Arundel Drive, Oldbury Birmingham, B69 1XE","West Midlands","B69 1XE","0741 145 1188",,"Community Services",Contract,,,"BS Social Care Agency","Support worker",s3://attachments.broadbean.com/306480663
306482985,"Jason Wilson",jasonefcwilson2016@hotmail.com,2019-10-10T00:14:46,gojobsite,,,,"0752 165 7900",,"Education and Training",Temporary,,,,"Farm Worker",s3://attachments.broadbean.com/306482985
306493633,"Lakshana Anilkumar Vijayalekshmy",lakshana15917@gmail.com,2019-10-10T03:00:54,gojobsite,"DE3 ODT",Derbyshire,"DE3 ODT",,,"Recruitment Consultancy",Permanent,,,"SFS Homes","Marketing Executive",s3://attachments.broadbean.com/306493633
306734261,"Nabeela Alhadh",nabeela13@hotmail.co.uk,2019-10-11T14:48:33,gojobsite,"39 Morland Road, Trafford, M16 9WZ","Greater Manchester","M16 9WZ","0777 632 5101",,"Human Resources and Personnel",Permanent,,,GoBack,"Casual Customer Service Advisor",s3://attachments.broadbean.com/306734261
306744779,"Ahsan Choudhary",ahsan1998x@gmail.com,2019-10-11T16:10:06,gojobsite,"53 Kensington Road, Chorlton, M21 9WU",Cheshire,"M21 9WU","0741 303 1199",,"Education and Training",Contract,,,,"Arabic Reading Teacher",s3://attachments.broadbean.com/306744779
306680815,"Wessley Price",wesley.price1980@gmail.com,2019-10-11T08:12:08,cvlibrary,"22 Lincoln tower , Gilby road, Birmingham, B16 8RH","West Midlands","B16 8RH","0739 409 7820",,"Call Centre and Customer Service",Temporary,,,Kinex,"Sales advisor",s3://attachments.broadbean.com/306680815
306729271,"Asif Iqbal",asifiqbal74@hotmail.com,2019-10-11T14:09:25,gojobsite,"32 Wellington Road, Smethwick, West Midlands, B67 6EU","West Midlands","B67 6EU","0778 463 1019",,"Call Centre and Customer Service",Temporary,,,"Kiswa Foods Ltd","Delivery Driver",s3://attachments.broadbean.com/306729271
306750625,"Mohammed Tahir Sultan",mohammed-sultan@hotmail.co.uk,2019-10-11T17:06:11,eden_brown_public_sector,"19 Thurman St, Hyson, NG7 5AU",Nottinghamshire,"NG7 5AU","0792 602 4516","0115) 978 3482","Social Care",Contract,,,,,s3://attachments.broadbean.com/306750625
306900955,"Shambik Ghose",rhythmosaicoffice@gmail.com,2019-10-13T13:03:11,eb_education,"48/3, Gariahat Road, Kolkata, West Yorkshire, N1A",,N1A,"44 758 613 7240",,"Education and Training",Temporary,,,"Leeds City College",,s3://attachments.broadbean.com/306900955
306786331,"Myrna Honey",myrnaaquino40@yahoo.co.uk,2019-10-12T03:42:44,reed_premium,", Croydon, CR0 3PD",Surrey,"CR0 3PD","0774 088 3417",,"Social Care",Temporary,,,,,s3://attachments.broadbean.com/306786331
306797741,"Samir Baral",baralsamir@hotmail.com,2019-10-12T07:50:16,reed_premium,"street , City: Pokhara - 6 Pokhara - 6 , Country: Nepal, Lakeside Lakeside",,,,"9776 146 3530","Education and Training",Temporary,,,,,s3://attachments.broadbean.com/306797741
306814219,"Manjunath Patil",mppatil16@gmail.com,2019-10-12T11:42:43,cvlibrary,"Image, HA03DB",London,HA03DB,"0785 334 5022",,"Admin and Secretarial",Contract,,,,"SECURITY OFFICER",s3://attachments.broadbean.com/306814219
306871025,"Aniko Orosz",aniko1334@gmail.com,2019-10-13T05:45:24,reed_premium,"Harlington, London",,,,"44 739 394 2299","Social Care",Contract,,,"London Heathrow Airport",Ambassador,s3://attachments.broadbean.com/306871025
306871591,"Malinas Eugenia",eugeniamalinas@gmail.com,2019-10-13T06:00:44,cvlibrary,SINCAI,,,,"075 547 9804","Education and Training",Temporary,,,,"Sales Manager",s3://attachments.broadbean.com/306871591
306913107,"None Roy Holland",dutchduo@tiscali.co.uk,2019-10-13T15:05:22,reed_premium,"77 Gainsborough Drive, Ascot, SL5 8TA",Berkshire,"SL5 8TA","0783 409 4533","0134 429 1218","Social Care",Temporary,,,"Vodafone Technology Information Services","Delivery Project Manager",s3://attachments.broadbean.com/306913107
306916051,"Irene Touray",princessirene9@yahoo.co.uk,2019-10-13T15:36:49,gojobsite,"62 rosefield road, Smethwick, B67 6DX","West Midlands","B67 6DX",,"0777 819 8655","Call Centre and Customer Service",Temporary,,,"Ngasi Hair Creations","Owner and Head Stylist",s3://attachments.broadbean.com/306916051
306917719,"Cristina Osta",crisospa@gmail.com,2019-10-13T15:55:12,eb_education,"C/, Cortes, de",,,"44) 0787 134 6352",,"Education and Training",Contract,,,,,s3://attachments.broadbean.com/306917719
308296781,"Rebecca Ihekoromadu",mariekah@hotmail.co.uk,2019-10-23T05:11:55,gojobsite,"4 Oakmere Lane, Potters Bar, EN6 5LS",Hertfordshire,"EN6 5LS","0798 389 9363",,,,,,"Furzefield Leisure Centre Potters Bar",,s3://attachments.broadbean.com/308296781
308348781,"Beth Scott",bethscott94@hotmail.com,2019-10-23T11:25:12,eden_brown_public_sector,"15 Marina Road, Droylsden, M43 7DB",Lancashire,"M43 7DB","0758 135 0542",,"Social Care",Contract,,,Centrepoint,"Student Social Worker/Homelessness Prevention Worker",s3://attachments.broadbean.com/308348781
279314651,"Akinyemi Femi Fagoke",ffagoke@gmail.com,2019-10-23T12:24:51,reed_premium,"10 Westhorpe Grove, Hockley, B19 3DA","West Midlands","B19 3DA","0747 433 2800",,"Community Services",Contract,,,"CARE WISH LTD","Team Leader",s3://attachments.broadbean.com/279314651
308241895,"Krzysztof Ziebicki",krismassage@outlook.com,2019-10-22T18:13:30,gojobsite,"16 Beechcroft , High Street, Henley in Arden, Warwickshire, B95 5AQ","West Midlands","B95 5AQ","00 44 7 852 726 321",,"Public Sector and Government",Temporary,,,,"Relief Duty Manager/Night Manager",s3://attachments.broadbean.com/308241895
308240815,"Priyanka Jaisswal",priyanka.jaisswal@gmail.com,2019-10-22T18:03:57,gojobsite,"05 Hereford court, Danes Gate, Harrow, London, HA1 4UG",London,"HA1 4UG","0746 636 6977","873 2599","Education and Training",Contract,,,"Virtusa Ltd","Business Manager / PMO Executive",s3://attachments.broadbean.com/308240815
308255781,"Rita Uzowuru",ritauzowuru@hotmail.com,2019-10-22T20:15:12,reed_premium,"132 MEADOWSIDE, Eltham, London, SE9 6BB",Kent,"SE9 6BB","0750 783 8124",,"Public Sector and Government",Temporary,,,"ELM Group Housing","Visiting Estate Manager",s3://attachments.broadbean.com/308255781
308257469,"Huzaenat Raji",husn.raji01@gmail.com,2019-10-22T20:30:47,gojobsite,"12 Monet Court, 2 Stubbs Drive, London, SE16 3EG",,,,"0747 992 9517","Public Sector and Government",Temporary,,,"London Borough of Richmond and Wandsworth Councils","Finance Officer",s3://attachments.broadbean.com/308257469
308550483,"Marius Gutue",gutuem@roehampton.ac.uk,2019-10-24T16:34:17,gojobsite,"Adress Details, Burton Trent, Staffordshire, De130un",Staffordshire,De130un,"0788 559 6611",,"Recruitment Consultancy",Permanent,,,"Automotive Factory     Grupo Antolin","Supervisor/Trainer/Quality inspector",s3://attachments.broadbean.com/308550483
308533867,"Soom Sumbal",soom.sumbal@live.com,2019-10-24T14:31:11,eb_education,", Salford",,,"0743 700 7720",,"Education and Training",Temporary,,,"J Rosenthal & Sons","Senior Designer",s3://attachments.broadbean.com/308533867
308434709,"Dominic Liburd",dominicliburd@hotmail.co.uk,2019-10-23T22:49:25,cvlibrary,"Image, N12 0LN",London,"N12 0LN","0777 503 7572",,"Admin and Secretarial",Contract,,,"Virgin Active Gym","Front of House Receptionist",s3://attachments.broadbean.com/308434709
308448895,"Fanuel Matibenga",fanmate@hotmail.com,2019-10-24T02:25:25,reed_premium,,,,"0750 809 3304","0203 509 6649","Social Care",Permanent,,,"Seva Care Group","Head of Operations",s3://attachments.broadbean.com/308448895
308560369,"Hannah Ogden",unknown_email@reed-26332513-synergy.com,2019-10-24T17:51:39,reed,"1 Ainthorpe Walk, Newton Heath, M40 1PZ","Greater Manchester","M40 1PZ","0785 370 4386",,,,,,"Queens rd",,s3://attachments.broadbean.com/308560369
308552071,"Gregory Fee",gregfee@btinternet.com,2019-10-24T16:47:34,cvlibrary,":, Image, S17 4QE",Derbyshire,"S17 4QE","0796 095 2345",,,,,,,,s3://attachments.broadbean.com/308552071
308556997,"Sophie-louise Stevens",Sophielouisestevens02@gmail.com,2019-10-24T17:22:58,cvlibrary,"[, Image",,,"0798 333 9982",,,,,,,assistant,s3://attachments.broadbean.com/308556997
308560529,"Kathryn De Jonge",kathidj10@yahoo.com,2019-10-24T17:52:19,gojobsite,"27, 100 On Montgomery Drive, Harare",,,"+263 77 708 2944",,"Education and Training",Contract,,,"St. Georges College","Art Teacher",s3://attachments.broadbean.com/308560529
308552895,"Thomas Donlon",thomas.donlon@hotmail.co.uk,2019-10-24T16:54:01,cvlibrary,"[, Image, Hillsborough, S6 4FH","South Yorkshire","S6 4FH","0789 697 0353",,,,,,"TD Sports Coaching","Co-Owner/ Head Coach",s3://attachments.broadbean.com/308552895
308586511,"Elie Ikwa",elie.ikwa@outlook.com,2019-10-24T22:47:48,gojobsite,,,,"0750 405 2715",,"Call Centre and Customer Service",Temporary,,,,"Sales advisor",s3://attachments.broadbean.com/308586511
309472175,"Nick Hunter",n.htr73@gmail.com,2019-10-31T10:03:13,gojobsite,"52 Marlborough avenue, Falmouth, Cornwall, tr11 4hs",Cornwall,"tr11 4hs",,"0738 343 0775","Human Resources and Personnel",Temporary,,,,"Degree Recruitment Consultant",s3://attachments.broadbean.com/309472175
309471983,"Nicola Reason",nreason26@gmail.com,2019-10-31T10:02:01,cvlibrary,"3 Sandwich Mews, Eastbourne, East Sussex, BN22 7FA","East Sussex","BN22 7FA","44 783 711 3201",,,,,,"Smithy Street Primary School","SEN Teaching Assistant",s3://attachments.broadbean.com/309471983
309464007,"Award in Undertaking End-Point Assessment (RQF)  Beverley Fletcher  Masters in Business Administrati",bfassociatesltd@gmail.com,2019-10-31T08:58:12,eden_brown_public_sector,"114, Manchester Road, Astley, M29 7EJ",Lancashire,"M29 7EJ","0797 425 1702","0194 238 9341","Education and Training",Contract,,,"START WELL","Start well worker",s3://attachments.broadbean.com/309464007
309471125,"Jemma Moore",jemmylou98@gmail.com,2019-10-31T09:56:02,cvlibrary,Eastbourne,,,"0792 726 6130",,,,,,"Carewatch Care Services Ltd","Care and Support Assistant",s3://attachments.broadbean.com/309471125
309474443,"S Paviour",spaviour@btinternet.com,2019-10-31T10:19:15,cvlibrary,"[, Image, BN23 7BP","East Sussex","BN23 7BP","0784 079 5957","1883 1927",,,,,Hlk18831039]Childminding,,s3://attachments.broadbean.com/309474443
309373509,"Kamel BOUAISSI",kamel.bouaissi@gmail.com,2019-10-30T16:11:24,reed_premium,,,,"0757 768 6585",,"Social Care",Temporary,,,,,s3://attachments.broadbean.com/309373509