Id,Candidate,"E-Mail Address","Application date / time","Latest Source","Address Line 1",County,Postcode,"Mobile Number","Home Phone Number",Industry,"Contract / Job Type Required","Current Status","Available Date","Current Employer","Current Job Title","Attachment URL"
369398039,"Christine Malabar",christinemalabar@hotmail.com,2021-02-04T12:08:58,cvlibrary,"9 Lingwell Park, Widnes, Cheshire, WA8 9YP",Cheshire,"WA8 9YP","0771 634 5604","0151 384 8015","Admin and Secretarial",Temporary,,,"Hugh Baird College",Lecturer,s3://attachments.broadbean.com/369398039
370707665,"Rameshwar Patluri",rameshwar.synergy@gmail.com,2021-02-03T16:52:36,gojobsite,"to join immediately, , [, Ready",,,"91 988 565 6025",,"Building and Construction",Permanent,,,"Ramky Infrastructure Limited","Assistant General Manager",s3://attachments.broadbean.com/370707665
370832555,"Saheed Oladipupo",oladipupo302@gmail.com,2021-02-04T13:08:04,gojobsite,,,,,,"Building and Construction",Contract,,,"Enyo Retail And Supply Ltd","Site Engineer",s3://attachments.broadbean.com/370832555
370821817,"Claire Bleloch",claireb@bleloch.com,2021-02-04T11:58:15,setsquare,"8 Cole Close, Taunton, Somerset, TA4 1NZ",Somerset,"TA4 1NZ",,"0182 343 3282","Admin and Secretarial",Temporary,,,"Debenhams PLC","Senior Finance Assistant",s3://attachments.broadbean.com/370821817
370802833,"Paul Boncey",paulboncey@hotmail.co.uk,2021-02-04T09:55:17,cvlibrary,"[, Image, B1","West Midlands",B1,"0754 517 6223",,"Building and Construction",Permanent,,,"Eddie Stobart Ltd (Employment Partners Ltd)","Transport Manager",s3://attachments.broadbean.com/370802833
370848095,"Josh Mcvitie",joshmcvitie@outlook.com,2021-02-04T14:48:13,setsquare,"110 Bay Street, Port Glasgow, PA14 5BN",Inverclyde,"PA14 5BN","0771 677 4340",,"Building and Construction",Contract,,,"INTEC Business Solutions","Sales Assistant",s3://attachments.broadbean.com/370848095
370567743,"David David",1959davidsquires@gmail.com,2021-02-02T19:40:52,cvlibrary,"West Midlands",,,,,Banking,Permanent,,,"Wates Group","Senior Project Manager",s3://attachments.broadbean.com/370567743
370570553,"dominic McAlwane",dominic.mcalwane@gmail.com,2021-02-02T20:02:16,setsquare,"133 Shanklin Dr, Leicester, Leicestershire, LE2 3QG",Leicestershire,"LE2 3QG","0793 555 2835","0739 555 2835","Building and Construction",Permanent,,,"South Coast Windows LTD","Project and Service Manager",s3://attachments.broadbean.com/370570553
370572403,"Ivan Morgan",ivanjmorgan@live.co.uk,2021-02-02T20:20:37,gojobsite,"of O29 Hillcroft Caravan Park, Cleobury Road, Bewdley, DY12 2QG",Worcestershire,"DY12 2QG",,,Electronics,Permanent,,,"Brintons Carpets Limited",,s3://attachments.broadbean.com/370572403
370574173,"Claire Lindquist",lindquistyacht@gmail.com,2021-02-02T20:36:15,setsquare,,,,"0787 621 3711",,"Admin and Secretarial",Temporary,,,"ABOUT ME","Project Manager",s3://attachments.broadbean.com/370574173
370570357,"Robert Henbury",roberthenbury@btinternet.com,2021-02-02T20:00:42,cvlibrary,"3 Bengarth road, Churchtown Southport, PR9 7HB",Merseyside,"PR9 7HB","0751 425 9438","0170 422 0749","Building and Construction",Permanent,,,,"kier Living Central Assistant site manager woodbury",s3://attachments.broadbean.com/370570357
370619241,"Jim Macdonald",mcdonald9@btinternet.com,2021-02-03T06:35:08,gojobsite,"18 vale of bonny, Bonny",,,,0776015447107340066488,FMCG,Temporary,,,,Manager,s3://attachments.broadbean.com/370619241
370643199,"Tanya Nawaz",tanya.nawaz@hotmail.co.uk,2021-02-03T10:20:20,setsquare,"Image, M21 0XG","Greater Manchester","M21 0XG","0790 852 6251",,"Building and Construction",Permanent,,,"John Lewis Core Home Services department - Didsbury","Project co Ordinator",s3://attachments.broadbean.com/370643199
370645531,"Carl Hopkins",ctehop@hotmail.co.uk,2021-02-03T10:36:24,cvlibrary,"Image, DY31BS","West Midlands",DY31BS,"0794 879 8302","0190 267 8368",Banking,Permanent,,,,"Jessup-Site Manager",s3://attachments.broadbean.com/370645531
370884347,"Mert ÃaÄrÄ± Piri",mertcagripiri@gmail.com,2021-02-04T19:22:19,setsquare,,,,,,"Building and Construction",Permanent,,,"MAKYOL CORPORATION","TECHNICAL OFFICE ENGINEER",s3://attachments.broadbean.com/370884347
370877061,"Leonart Kumanaku",av_nard@msn.com,2021-02-04T18:15:33,gojobsite,", Brierley Hill, West Midlands",,,"0794 674 3770",,Electronics,Permanent,,,"Serco Group Plc",,s3://attachments.broadbean.com/370877061
370877451,"Theophilus kamara",Theokamara@outlook.com,2021-02-04T18:18:15,setsquare,,,,"0790 439 0307",,"Health and Safety",Temporary,,,"Covid Tester",,s3://attachments.broadbean.com/370877451
366157417,"Mark Jackson",a.summers656@btinternet.com,2021-02-05T07:34:46,cvlibrary,"87 Peter James Court, Stafford, ST16 3YX",Staffordshire,"ST16 3YX","0741 519 0962","0178 574 7412","Building and Construction",Temporary,,,A50,,s3://attachments.broadbean.com/366157417
370881451,"Heather Dakin",heatherdakin40@yahoo.com,2021-02-04T18:50:17,setsquare,"44 Booth Close, Nottingham, NG3 1DH",Nottinghamshire,"NG3 1DH","0782 152 4029",,"Building and Construction",Temporary,,,,Waiter/Plate,s3://attachments.broadbean.com/370881451
367704085,"Michael J Ball",michba391@aol.com,2021-02-05T08:08:14,setsquare,"47 Lonsdale Road, Exeter, EX1 3DP",Devon,"EX1 3DP","0752 893 1890",,"Building and Construction",Permanent,,,"Total Group Building Services","Contracts Manager",s3://attachments.broadbean.com/367704085
371347011,"Liam Hancock",Liam.Hancock85@hotmail.co.uk,2021-02-08T16:15:18,setsquare,"CustomerAddress]8 Lord Murray Drive, TELFORD, TF7 5TZ",Shropshire,"TF7 5TZ","0746 033 0301",,"Building and Construction",Permanent,,,RM,,s3://attachments.broadbean.com/371347011
371355773,"Karen Michelle Anderson",adarobbie64@yahoo.com,2021-02-08T17:16:14,setsquare,Walsall,,,,,"Building and Construction",Temporary,,,"Village Hotel",Housekeeping,s3://attachments.broadbean.com/371355773
371215589,"Jermaine Jackson",jermaineprojects1@gmail.com,2021-02-08T17:18:47,gojobsite,,,,"0749 048 9126",,"Building and Construction",Permanent,,,"Tritek Consulting LTD","Project Manager",s3://attachments.broadbean.com/371215589
371380983,"Antonio De Miranda",mirand200@yahoo.co.uk,2021-02-08T20:49:36,gojobsite,"4 Surrey House Tel/Fax 02036893582, Stratton Close, MIRANDA, DE, HA8 6PX",London,"HA8 6PX","0773 989 6560","0203 689 3582","Building and Construction",Contract,,,"BOUYGUES UK LTD","Site Engineer",s3://attachments.broadbean.com/371380983
371309943,"Ashley Appleton",a.appleton89@hotmail.com,2021-02-08T12:56:14,setsquare,"131 Elgar Street, Surrey Quays, SE16 7QP",London,"SE16 7QP","0749 641 6299",,"Health and Safety",Temporary,,,,"Cleaning Operative",s3://attachments.broadbean.com/371309943
371316461,"Verinea Bourne",Verineab@gmail.com,2021-02-08T13:32:13,setsquare,"104 Warwick Road, Thornton Heath, Surrey",,,,,"Health and Safety",Temporary,,,"Procare GB Ltd","Service Improvement Manager",s3://attachments.broadbean.com/371316461
371320737,"Tarik MOKHLESSE",ranffiyahya@gmail.com,2021-02-08T13:55:26,cvlibrary,":, Image, london, NW10 5NU",London,"NW10 5NU",,"00 44 7 305 023 800","Building and Construction",Contract,,,"HIPODROME CASINO CLUB","waiter in charge and manager",s3://attachments.broadbean.com/371320737
368801787,"Evie Lin",ll2063@bath.ac.uk,2021-02-08T15:06:49,cvlibrary,"FFF 3 Albion Terrace, Bath",,,"+44 7902 381962",,"Building and Construction",Permanent,,,"UNIVERSITY OF BATH",Master,s3://attachments.broadbean.com/368801787
370099695,"Sarath Menon",menonuk90@gmail.com,2021-01-29T19:11:02,cvlibrary,", Bolton",,,"44 743 877 1049",,"Building and Construction",Permanent,,,"Zenith Insulation Cont. Co. L.L.C","Procurement Engineer",s3://attachments.broadbean.com/370099695
370141263,"Lynsey Dow",Lynsey31@live.co.uk,2021-01-30T09:10:16,setsquare,"19 Swintons Place, Hill of Beath, Fife, KY4 8DS",Fife,"KY4 8DS","0751 672 3740",,"Admin and Secretarial",Temporary,,,,"Commercial Cleaner",s3://attachments.broadbean.com/370141263
370157159,"Kelvin Ibrahim",kelbraimo@gmail.com,2021-01-30T14:03:20,setsquare,,,,,,"Health and Safety",Temporary,,,"NHS COVID TESTING CENTRE","MEDx BOX SUPERVISOR",s3://attachments.broadbean.com/370157159
370049063,"Donavan Lowe",jojokirk27071977@gmail.com,2021-02-01T12:18:36,cvlibrary,"Image, Dy2 0RX","West Midlands","Dy2 0RX","0757 201 5987",,"Building and Construction",Temporary,,,,Waiter,s3://attachments.broadbean.com/370049063
370281649,"Satnam Kaur",ksatnam900@gmail.com,2021-01-31T22:45:46,gojobsite,"14 Groveland Road, Tipton, West Midlands, DY47TL","West Midlands",DY47TL,"0781 040 9811",,"Building and Construction",Temporary,,,,,s3://attachments.broadbean.com/370281649
370302779,"Deewa Rai",raideewa1@gmail.com,2021-02-01T10:34:19,gojobsite,"25 Embry Drive, Stanmore, Middlesex, HA7 3SJ",London,"HA7 3SJ","0745 437 7874","0208 954 0197","Health and Safety",Temporary,,,"Wasabi Restaurant","team member",s3://attachments.broadbean.com/370302779
370311095,"Robert grady",robertgrady@hotmail.com,2021-02-01T11:28:35,cvlibrary,":, Image, DN4 0XF","South Yorkshire","DN4 0XF","0773 922 4766",,"Building and Construction",Permanent,,,"Omega Enviromental","Planning Engineer",s3://attachments.broadbean.com/370311095
368009695,"Pieter Botha",pieter.botha@yahoo.com,2021-02-01T11:50:19,setsquare,"23 Somerwood Close, Appleby, CA16 6BH",Cumbria,"CA16 6BH","44 798 308 3344","44 737 970 1260","Building and Construction",Permanent,,,"Farrans Construction","Health and Safety Coordinator",s3://attachments.broadbean.com/368009695
370322891,"Dave Grant",dave.grant@live.co.uk,2021-02-01T12:26:11,cvlibrary,"*, Dave",,,"44(0) 793 105 7872",,"Building and Construction",Permanent,,,"BWEC ltd","Electrical Estimator",s3://attachments.broadbean.com/370322891
369819917,"Naveed KIYANI",kiyaninaveed7@gmail.com,2021-01-27T21:44:27,gojobsite,,,,"00 44 7 506 347 446","00 44 7 506 488 037","Health and Safety",Temporary,,,"ACCOUNT ASSITANT AT 1STCALL Ltd UK",,s3://attachments.broadbean.com/369819917
369814667,"Andrew Powell",pwllandre@aol.com,2021-01-27T19:42:00,cvlibrary,"5 Glenview Rise, Newbridge, Gwent, NP11 4HZ",Caerffili,"NP11 4HZ","0776 903 6948","0149 524 0525","Building and Construction",Permanent,,,"NATO Brussels","Contracting Officer",s3://attachments.broadbean.com/369814667
369831523,"Kelli Ann Wilson",kelliwilson@live.co.uk,2021-01-27T22:24:52,setsquare,"Rainhill, L35 8QH",Merseyside,"L35 8QH","0773 191 8144",,"Building and Construction",Permanent,,,"Arrow Business Communications - Merseyside","IT Administrator",s3://attachments.broadbean.com/369831523
361904749,"Darren Sullivan",darrensul@msn.com,2021-01-27T17:47:40,setsquare,"7 Lion Court, Nash Mills Wharf, Croxley Road, Hemel Hempstead, Herts, HP3 9GX",Hertfordshire,"HP3 9GX","0750 025 1282","6232 8193","Building and Construction",Permanent,,,"Havering Borough Council",,s3://attachments.broadbean.com/361904749
366870239,"Oliver Sykes",4381ojs@gmail.com,2021-01-27T18:31:29,setsquare,,,,"0776 213 8050",,"Building and Construction",Contract,,,,"Site Manager",s3://attachments.broadbean.com/366870239
369850009,"Davone Elliott-williams",davoneelliottwilliams@gmail.com,2021-01-28T04:26:23,gojobsite,,,,"0796 081 5469",,"Health and Safety",Temporary,,,"All In Black/Knights Security - SIA",Supervisor,s3://attachments.broadbean.com/369850009
369840183,"Dalgis De Armas",coquitoprieto1@yahoo.es,2021-01-27T23:39:16,gojobsite,,,,"0795 580 3381",,"Building and Construction",Contract,,,,"Voluntary Shop Charity Edinburgh",s3://attachments.broadbean.com/369840183
369900255,"John Forshaw",johnforshaw1@gmail.com,2021-01-28T21:03:18,cvlibrary,"[, Image, LA3 1TY",Lancashire,"LA3 1TY","0787 682 6828",,"Building and Construction",Temporary,,,,"Construction labourer",s3://attachments.broadbean.com/369900255
369968113,"Robert Osullivan",robertbuffyx@aol.com,2021-01-28T20:55:44,cvlibrary,":, Image, SE5 9BY",London,"SE5 9BY","0793 031 8410","0207 737 1450","Building and Construction",Contract,,,,"painter and decorator",s3://attachments.broadbean.com/369968113
369947103,"Kenneth Brisbane",brissy@email.com,2021-01-28T19:49:46,setsquare,"31 Fir Park, Tillicoultry, Clackmannanshire, FK136PX",Clackmannanshire,FK136PX,"0785 106 1051",,"Building and Construction",Contract,,,"Dolby's Vivisol - Stirling","Warehouse Labourer",s3://attachments.broadbean.com/369947103
369951805,"Erin Jones",Erinsamanthajones@gmail.com,2021-01-28T20:03:30,setsquare,"Hammer Farm, Knowle Lane, Cranleigh, GU6 8JW",Surrey,"GU6 8JW","0780 916 5404",,"Building and Construction",Contract,,,"Lynn Murray & Co",,s3://attachments.broadbean.com/369951805
369960327,"Sundeep Sodhi",Sunny_s10@hotmail.com,2021-01-28T20:29:02,setsquare,"69 Brook Street, Dudley, DY3 1AG","West Midlands","DY3 1AG","0794 327 3727",,"Building and Construction",Permanent,,,EE,"Senior Sales Assistant",s3://attachments.broadbean.com/369960327
369974839,"Corey Sutton",cori2004@icloud.com,2021-01-28T21:23:35,gojobsite,", L11 4UQ",Merseyside,"L11 4UQ","0793 902 8584",,"Building and Construction",Temporary,,,,,s3://attachments.broadbean.com/369974839
370297327,"Connor Conneely",cconneely98@gmail.com,2021-02-01T09:56:24,gojobsite,"139 Pennard Avenue, Liverpool, L36 3SH",Merseyside,"L36 3SH","0784 046 6867",,"Building and Construction",Temporary,,,"Counterline Ltd",Electrician,s3://attachments.broadbean.com/370297327
370357049,"Chantalle Reid",Chaniereid@yahoo.com,2021-02-01T15:19:13,setsquare,"Kirkcaldy, KY1 3HG",Fife,"KY1 3HG","0751 564 0962",,FMCG,Temporary,,,McDonald's,"Crew Member",s3://attachments.broadbean.com/370357049
369318055,"Natasha Bird",tash433@gmail.com,2021-01-30T21:18:24,cvlibrary,": ], PERSONAL DETAILS , Natasha, Image, TA3 5FG",Somerset,"TA3 5FG","0786 892 3533",,"Building and Construction",Temporary,,,"Bishops Foxes","School Cleaner",s3://attachments.broadbean.com/369318055
370195147,"Hollie whiteley",H.whiteley8@icloud.com,2021-01-30T21:55:17,setsquare,": ], , Hollie, Image, MK13 0BG",Buckinghamshire,"MK13 0BG","0770 132 4767",,Sales,Permanent,,,,"Country Wide/Taylor Wimpey Senior Sales Negotiator New Homes",s3://attachments.broadbean.com/370195147
370186607,"Amira Mohamed",amira.mohamed18@outlook.com,2021-01-30T19:20:15,setsquare,"Flat 13 Aphrodite Court, 2 Warton Rd, Stratford, LONDON, E15 2FG",London,"E15 2FG","0794 629 2070",,"Health and Safety",Temporary,,,"Queens cosmetics",,s3://attachments.broadbean.com/370186607
368661213,"Garin Williams",garinwilliams98@gmail.com,2021-02-01T14:05:19,setsquare,"65 Tillery Road, Abertillery, Gwent, NP13 1HY","Blaenau Gwent","NP13 1HY","0759 277 3132","0149 532 0568","Building and Construction",Permanent,,,Morrisons,"Customer Assistant",s3://attachments.broadbean.com/368661213
370344139,"Conni Miller",connimiller66@hotmail.com,2021-02-01T14:12:13,setsquare,"66 Oakley Road, KY12, GB",,,,"0734 086 4156",FMCG,Temporary,,,,Cleaner,s3://attachments.broadbean.com/370344139
370294767,"Silvia putoi",Silvia.putoi@gmail.com,2021-02-01T09:38:13,setsquare,"8 Richardson Close, Whitefield, M45 8SS","Greater Manchester","M45 8SS","0749 360 4442",,"Building and Construction",Permanent,,,,"Senior Buyer",s3://attachments.broadbean.com/370294767
368165197,"Joel Nziza",nziza.joel@yahoo.co.uk,2021-01-31T21:34:38,cvlibrary,"[, Image, BA2 2UL",Somerset,"BA2 2UL",,,"Building and Construction",Contract,,,"Derwent FM","Maintenance Assistant",s3://attachments.broadbean.com/368165197
370277035,"Ali Talpur",alitalpur@gmail.com,2021-01-31T21:36:02,cvlibrary,"[, Image",,,"771 734 6426",,"Building and Construction",Permanent,,,EnQuest,Director,s3://attachments.broadbean.com/370277035
370309419,"Connor Mcclelland",oconcon70@icloud.com,2021-02-01T11:19:13,setsquare,"1 Uplands Avenue, M26 1LT","Greater Manchester","M26 1LT",,"0739 557 4082","Building and Construction",Contract,,,"Segen Ltd",,s3://attachments.broadbean.com/370309419
370308829,"Ryan knapp",Ryanknapp99@icloud.com,2021-02-01T11:15:11,setsquare,"Weston-super-Mare, BS22 6DJ",Somerset,"BS22 6DJ","0793 199 1929",,"Building and Construction",Contract,,,,Present,s3://attachments.broadbean.com/370308829
370339241,"Cristina Gherca",cristina.sabrina1999@gmail.com,2021-02-01T13:46:14,setsquare,"Flat 16 Hampton Court, Batavia Roud, SE14 6AQ",London,"SE14 6AQ","0754 469 9958",,"Health and Safety",Temporary,,,"Rawsha Lounge LTD",Bartender,s3://attachments.broadbean.com/370339241
370364751,"Jack McCaskill",Jackmackoz@hotmail.com,2021-02-01T15:58:13,setsquare,"3 Benjamin Drive , Bo'ness",,,"0783 829 5435",,"Building and Construction",Contract,,,"Robert Mcgregor ROughcasting",Labourer,s3://attachments.broadbean.com/370364751
370096295,"Humsa Gulla",humsagulla@yahoo.com,2021-02-01T16:14:13,cvlibrary,"[, Image",,,"0754 837 5963",,"Admin and Secretarial",Temporary,,,"SPIE UK","FM Helpdesk Supervisor",s3://attachments.broadbean.com/370096295
370368431,"Kul Rathore",krathore17@hotmail.com,2021-02-01T16:18:54,gojobsite,Maidstone,,,,"0739 958 1292","Building and Construction",Contract,,,,,s3://attachments.broadbean.com/370368431
371730225,"Silvio De Vito",silviodevito@libero.it,2021-02-11T07:12:11,setsquare,"44/4 East Fountainbridge",,,"00 44 7 761 346 665",,FMCG,Contract,,,Studium,"University Tutor",s3://attachments.broadbean.com/371730225
371730365,"Nigel Dixon",nige.dixon@sky.com,2021-02-11T07:14:06,cvlibrary,"LinkedIn *, Worthing, West Sussex",,,"0776 208 8652",,"Building and Construction",Contract,,,"Hayes Agency","Logistics Site Manager",s3://attachments.broadbean.com/371730365
347237651,"Matteo Bertin",mdbertin@icloud.com,2021-02-11T11:49:13,gojobsite,"83 Cathedral Road, Cardiff, CF11 9PG",Caerdydd,"CF11 9PG","0785 287 2169",,"Building and Construction",Permanent,,,ISG,"Site Manager",s3://attachments.broadbean.com/347237651
371677899,"Sam Adams",samadams85@me.com,2021-02-10T20:12:11,cvlibrary,"carpenter and joiner, London",,,,"0730 508 3892","Building and Construction",Contract,,,"Carpenter and General Builder",,s3://attachments.broadbean.com/371677899
371668201,"Nizar Sahli",niiz.sahli85@gmail.com,2021-02-10T18:44:15,setsquare,", Milton Keynes",,,,"44 736 626 1147",Sales,Permanent,,,DEBENHAMS,"Sales advisor",s3://attachments.broadbean.com/371668201
366570683,"Jason Collins",mrcollinsjason@outlook.com,2021-02-10T18:48:27,cvlibrary,"9 St Margaret's Close, Whitstable, Kent, CT5 4ST",Kent,"CT5 4ST","0757 824 7693",,"Building and Construction",Permanent,,,"SGC Build Ltd","Site Manager",s3://attachments.broadbean.com/366570683
371680251,"Ricky Archer",Rickyyarcher@gmail.com,2021-02-10T20:33:16,setsquare,,,,"44 795 621 6375",,"Building and Construction",Permanent,,,"Balgores Property Services","Property Consultant",s3://attachments.broadbean.com/371680251
347236803,"Paul Deary",pauldeary1960@hotmail.co.uk,2021-02-10T19:22:51,cvlibrary,"3 THE FAIRWAYS, LIVERPOOL, L25 9RN",Merseyside,"L25 9RN","0796 064 4160",,"Building and Construction",Contract,,,,Labourer,s3://attachments.broadbean.com/347236803
359682621,"Surekha Nayee",surekhanayee@gmail.com,2021-02-10T19:25:38,gojobsite,"20 Wingfield Place, Winsford, Cheshire, CW7 1HD",Cheshire,"CW7 1HD","0791 777 1738","0160 655 2325","Building and Construction",Contract,,,"The Plough     Whitegate",Cleaner,s3://attachments.broadbean.com/359682621
371740537,"Laqwan Belgrave",Belgravelaquarn@gmail.com,2021-02-11T09:11:13,setsquare,,,,"0753 411 9895",,"Building and Construction",Contract,,,"Offloader - CM Limited",Supervisor,s3://attachments.broadbean.com/371740537
371744253,"Soumendranath Dutta",soumendranath76@gmail.com,2021-02-11T09:45:06,gojobsite,Overall,,,,,"Building and Construction",Contract,,,,,s3://attachments.broadbean.com/371744253
371822683,"Don Birkinshaw",don.g.birkie@gmail.com,2021-02-11T20:09:47,gojobsite,"52b Welfare Road, Doncaster, dn67qf","South Yorkshire",dn67qf,"0782 682 2677","0130 272 6729","Building and Construction",Temporary,,,,,s3://attachments.broadbean.com/371822683
363474717,"Arthur Parker",parkerfour@sky.com,2021-02-11T19:19:15,setsquare,"14 Craigbarnet Avenue, Torrance, East Dunbartonshire",,,"0794 339 5119",,"Building and Construction",Contract,,,,,s3://attachments.broadbean.com/363474717
371468765,"Sunny G",mrsunnyvg@gmail.com,2021-02-09T12:39:03,gojobsite,,,,,"009 689 321 9365","Building and Construction",Contract,,,,"Project Engineer",s3://attachments.broadbean.com/371468765
371479301,"David Kenny",davie38_uk@hotmail.com,2021-02-09T13:41:37,cvlibrary,":, Image, LN12FR",Lincolnshire,LN12FR,"0798 544 2561","0152 238 9696","Building and Construction",Permanent,,,"NG Bailey","Interim Procurement Specialist",s3://attachments.broadbean.com/371479301
370983501,"Chandrakant Patel",54peet@gmail.com,2021-02-09T13:15:33,global_rail_jobs,"Flat 7, St Peters House, 35 Charnwood Street, Derby, DE1 2GU",Derbyshire,"DE1 2GU","0771 083 6005",,"Building and Construction",Contract,,,"Derby City Furniture","Warehouse Operative",s3://attachments.broadbean.com/370983501
371483303,"Marlon Palmer",marlon.kieran.palmer1987@gmail.com,2021-02-09T14:06:47,cvlibrary,"24 Carlisle Street, Birmingham, West Midlands, B18 7EW","West Midlands","B18 7EW","0793 267 0636",,"Building and Construction",Temporary,,,"Marlon Kieran Palmer",,s3://attachments.broadbean.com/371483303
371778873,"Antony Pateman",Antonypateman1960@hotmail.com,2021-02-11T14:02:22,cvlibrary,"71 Palliser Drive, Rainham, Essex, RM13 9TG",London,"RM13 9TG","0789 580 0877",,"Building and Construction",Contract,,,,"Painter and decorator",s3://attachments.broadbean.com/371778873
371813707,"Luke J  Thomas",lj_cro_1@yahoo.co.uk,2021-02-11T18:36:04,cvlibrary,"11 Halsbury road, Kensington, L6 6DG",Merseyside,"L6 6DG","0754 420 7702","0151 222 9861","Building and Construction",Temporary,,,"Carer / Packer          Mcvittie Canworks",,s3://attachments.broadbean.com/371813707
371803159,"Abraham Habtom",abrahamhbtm@yahoo.co.uk,2021-02-11T17:46:53,setsquare,"09 Woods House, Stewarts Road, London, SW84LA",London,SW84LA,,"0739 982 3412","Health and Safety",Temporary,,,"S  K  I  L  L  S AND ABILITIES",Topman,s3://attachments.broadbean.com/371803159
371807207,"Jack Ramsay",jramsay16@msn.com,2021-02-11T18:01:11,setsquare,"49 Woodend Place, Hill of Beath, KY4 8ED",Fife,"KY4 8ED","0783 730 8480",,"Building and Construction",Contract,,,"Painter & Decorator		      Novus Property Solutions",,s3://attachments.broadbean.com/371807207
371807161,"Dawid Wojciechowski",wojciechowskidawid@gmail.com,2021-02-11T18:00:47,cvlibrary,,,,"0778 433 4489",,"Building and Construction",Temporary,,,"Hays Recruitment",,s3://attachments.broadbean.com/371807161
371847695,"Alex Borg-Grech",bedlam_alex@hotmail.com,2021-02-12T02:35:47,setsquare,"20 Wallacestone Brae, Falkirk, FK2 0DQ",Falkirk,"FK2 0DQ","0777 234 3139",,"Building and Construction",Contract,,,"SDM Bodyshop","Panel Technician",s3://attachments.broadbean.com/371847695
359569577,"Bill Hinsley",bill.hinsley@gmail.com,2021-02-13T18:08:42,gojobsite,"81 Telegraph place, Isle, London, E14 9XA",London,"E14 9XA","0794 952 2319",,"Building and Construction",Contract,,,"Ballymore Construction services Limited","Joinery package manager",s3://attachments.broadbean.com/359569577
372024253,"Thomas Hayes",mayohayes@hotmail.co.uk,2021-02-13T20:07:11,cvlibrary,"54 Addison Road, Worcester, WR3 8EA",Worcestershire,"WR3 8EA","0792 687 4916",,"Building and Construction",Temporary,,,"Glasgow Warriors / Celtic League",,s3://attachments.broadbean.com/372024253
372018775,"Denis Gorman",denisgorman007@gmail.com,2021-02-13T18:23:43,gojobsite,"74 Kilberry Street, Glasgow, G21 2HJ","East Dunbartonshire","G21 2HJ","0775 601 3739",,"Building and Construction",Contract,,,"Lagan Construction","Ground Worker",s3://attachments.broadbean.com/372018775
371861611,"Angela Smith",angelinabalerina@hotmail.co.uk,2021-02-12T06:34:35,cvlibrary,"105A The Annex, Gillingham Road, Gillingham, Kent, ME7 4RS",Kent,"ME7 4RS","0755 702 4945",,"Human Resources and Personnel",Temporary,,,,,s3://attachments.broadbean.com/371861611