Id,Candidate,"E-Mail Address","Application date / time","Latest Source","Address Line 1",County,Postcode,"Mobile Number","Home Phone Number",Industry,"Contract / Job Type Required","Current Status","Available Date","Current Employer","Current Job Title","Attachment URL"
378078343,"Corrinne Daniels",cozdaniels@hotmail.co.uk,2021-04-03T08:52:01,cvlibrary,"48 Long Lane, Garston, Merseyside, L19 6PF",Merseyside,"L19 6PF","0778 301 7094","0151 291 4570","Building and Construction",Temporary,,,,"House Parent",s3://attachments.broadbean.com/378078343
378141313,"Joao Manuel Da Silva Alves Da Cruz",xmsa82@gmail.com,2021-04-04T07:54:52,gojobsite,"Flat 8 Charlton House, Queen Caroline St, Hammersmith, London, W6 9BU",London,"W6 9BU","0759 952 2329",,"Building and Construction",Temporary,,,"Instalaciones Luis",,s3://attachments.broadbean.com/378141313
358176323,"JosÃ© Cardenas Correa",correa522@hotmail.com,2021-04-04T07:51:02,cvlibrary,", CR7 8HU",London,"CR7 8HU","0745 023 0962",,"Health and Safety",Temporary,,,"On Android",,s3://attachments.broadbean.com/358176323
378134315,"Onike Span",onike.span002@sonicjobs.me,2021-04-04T05:51:34,cvlibrary,"LinkedIn URL *, Margate, Kent",,,,"0737 769 2759","Building and Construction",Temporary,,,"SG Defreitas and Company Ltd","Senior Technician",s3://attachments.broadbean.com/378134315
378144491,"Steven Taylor",stevedtaylor22@gmail.com,2021-04-04T08:42:02,cvlibrary,"17 parkinson drive, Chelmsford, Essex, CM1 3GU",Essex,"CM1 3GU","0750 712 7669",,"Building and Construction",Temporary,,,,,s3://attachments.broadbean.com/378144491
378143929,"Mustafa Ornek",mustafaornek32@hotmail.com,2021-04-04T08:44:27,gojobsite,,,,"90) 5417 4101",,Engineering,Permanent,,,"Imbat Coal Mining","Mechanical Chief Engineer",s3://attachments.broadbean.com/378143929
378111439,"Roan Hall",roanhall821@gmail.com,2021-04-03T17:54:11,gojobsite,"34 Borstal Street, Rochester, Kent, ME1 3HL",Kent,"ME1 3HL","0775 439 5511",,"Community Services",Temporary,,,"Peacejam International","Head Mentor / Leader",s3://attachments.broadbean.com/378111439
366141933,"Diabe Diabira",newjackrock@yahoo.co.uk,2021-04-03T21:15:14,cvlibrary,"[, Image, W6 7DS",London,"W6 7DS",,"0737 719 6909","Public Sector and Government",Temporary,,,"Chelsea Football club","Safety Steward",s3://attachments.broadbean.com/366141933
378124867,"Oleksandr (Alex) Khomchuk",alex.khomchuk@gmail.com,2021-04-03T23:28:13,cvlibrary,"30 Chapterhouse Road, Luton, Bedfordshire, LU4 0NN",Bedfordshire,"LU4 0NN","0785 409 3252",,Engineering,Permanent,,,"GU Desserts","Maintenance Manager",s3://attachments.broadbean.com/378124867
378173807,"Praveen Meled",praveenmeled8766@gmail.com,2021-04-04T17:13:50,gojobsite,,,,,"876 692 0460","Building and Construction",Temporary,,,Not,"Construction worker",s3://attachments.broadbean.com/378173807
364302535,"Christine Butler",ladychristinebutler@gmail.com,2021-04-03T07:43:21,cvlibrary,"26 Linden Avenue, Thornton Heath, Surrey, CR7 7DU",London,"CR7 7DU","0793 910 4081",,"Public Sector and Government",Temporary,,,"Virgin Atlantic","Customer Service Supervisor",s3://attachments.broadbean.com/364302535
378168695,"Stacey Moises",staceymoi@aol.com,2021-04-04T15:52:42,gojobsite,,,,,"0737 608 8148","Building and Construction",Contract,,,"The Scottish Legal Aid Board",,s3://attachments.broadbean.com/378168695
378169631,"Vitalijs Kondelevskis",kvitalijs@yahoo.com,2021-04-04T16:12:04,gojobsite,"21 Warden Road, Coventry, West Midlands, CV6 3EH",Warwickshire,"CV6 3EH","0792 105 3678",,"Property and Housing",Permanent,,,,Welder,s3://attachments.broadbean.com/378169631
370908837,"Efosa Osifo",djustshallive@gmail.com,2021-04-05T06:09:00,gojobsite,"1, First Power Line, Edo",,,"+234 806 047 6110",,"Building and Construction",Permanent,,,,Plumber,s3://attachments.broadbean.com/370908837
378183347,"Hendrick Mwanza",hendrickmwanza@outlook.com,2021-04-04T19:56:40,gojobsite,", Woking, Surrey",,,"0799 933 4568",,"Logistics Distribution and Supply Chain",Temporary,,,McLaren,,s3://attachments.broadbean.com/378183347
378199785,"Trevor Tompkins",trevortompkinsbm@gmail.com,2021-04-05T03:48:09,gojobsite,"28 Cobb Close, Datchet, SL3 9QZ",Berkshire,"SL3 9QZ","0773 462 6899",,"Manufacturing and Production",Permanent,,,"TGW Logistics","Multi Skilled Maintenance Engineer",s3://attachments.broadbean.com/378199785
378183051,"Zohare Bhaiji",zohare@mail.com,2021-04-04T19:49:31,gojobsite,"Senior Quantity Surveyor, Woodnook Farm |, Hardisty, LS21 2PQ","West Yorkshire","LS21 2PQ","0791 773 1405",,"Building and Construction",Permanent,,,"Mitchell and Urwin Brickwork Contractors","Senior Quantity Surveyor",s3://attachments.broadbean.com/378183051
222717943,"Scott Smith",scottsmith020487@gmail.con,2019-10-28T12:24:01,findajob,"7 Greenbraes crescent, Gourdon, DD10 0NG",Aberdeenshire,"DD10	0NG",,"0739 957 0777","Trade and Services",Temporary,,,"AGILE	Rig	&	Modules",Electrician,s3://attachments.broadbean.com/222717943
249436429,"Emmanuel Ankumah",ekankumah@gmail.com,2019-10-28T17:57:25,cvlibrary,"5 Sussex Court, Addlestone, KT15 2NF",Surrey,"KT15 2NF","0745 947 3165",,"Building and Construction",Permanent,,,"WorleyParsons Atlantic Limited","Project / Quality Engineer",s3://attachments.broadbean.com/249436429
308973779,"Jamie-lee Ives",jamieleeives@hotmail.com,2019-10-28T15:48:22,gojobsite,,,,"0757 227 0749",,"Admin and Secretarial",Permanent,,,"Financial Ombudsman Service","Financial Complaints Administrator",s3://attachments.broadbean.com/308973779
309008621,"Siobhan McGoldrick",mcgoldricksiobhan@icloud.com,2019-10-28T20:04:21,findajob,"7 Shortroods Road, Paisley, Renfrewshire",,,"0750 173 6471",,"Admin and Secretarial",Temporary,,,"What Policy","admin assistant",s3://attachments.broadbean.com/309008621
309009047,"Katie Bell",jamielee20199@icloud.com,2019-10-28T20:07:47,reed,", Southampton, SO19 9NY",Hampshire,"SO19 9NY",,"0736 829 6862","Building and Construction",Permanent,,,,,s3://attachments.broadbean.com/309009047
308992379,"VinÃ­cius Pinheiro Porto",vicoporto@gmail.com,2019-10-28T17:55:12,cvlibrary,"Location: *, Birmingham, B16 9JB","West Midlands","B16 9JB","0750 792 6649",,"Building and Construction",Temporary,,,"Instituto Maramar","Front-end Web Designer",s3://attachments.broadbean.com/308992379
308984693,"Stuart Vincent",stuart.vincent@hotmail.co.uk,2019-10-28T17:00:30,resourcing_group,"130 Murchison, Bexley, Kent, DA5 3LL",Kent,"DA5 3LL","0755 733 6721",,"Building and Construction",Temporary,,,"Sovereign Ceilings Limited",Fixer,s3://attachments.broadbean.com/308984693
308985581,"Lorna Smith",Lorna.smith85@yahoo.co.uk,2019-10-28T17:04:11,resourcing_group,"12 Park Edge Close, Leeds, LS8 2LP","West Yorkshire","LS8 2LP","0796 360 2750",,"Call Centre and Customer Service",Temporary,,,Npower,"Advanced Data Collection Specialist Team Manager",s3://attachments.broadbean.com/308985581
308989257,"Shannon Smart",shannonsmart@hotmail.co.nz,2019-10-28T17:29:42,zoek,,,,,"027 378 8673","Not for Profit and Charities",Temporary,,,"Open Home Foundation","Social Worker",s3://attachments.broadbean.com/308989257
308653787,"Fola Adefuye",afoadefuye@hotmail.com,2019-10-28T15:54:16,cvlibrary,":, Image, Essex, CM2 6SS",Essex,"CM2 6SS","0798 521 3787",,"Public Sector and Government",Contract,,,,"Area Sq",s3://attachments.broadbean.com/308653787
302009367,"Karl O'Flaherty",karloflaherty@outlook.com,2019-10-30T08:03:12,gojobsite,", N19 5BQ",London,"N19 5BQ","0753 999 2869",,"Building and Construction",Contract,,,SMSTS,SSSTS,s3://attachments.broadbean.com/302009367
309229697,"Beshoy Metry",e.beshoysabry@yahoo.com,2019-10-30T07:08:17,ziprecruiter,Minia,,,,"0122 196 4293","Building and Construction",Permanent,,,"ORASCOM CONSTRUCTION INDUSTRIES","CIVIL ENGINEER",s3://attachments.broadbean.com/309229697
218320133,"Marcelo Leon",marcelinhomaue@gmail.com,2019-10-30T09:39:50,reed,"6 Dudley Place, New Milton, BH25 6JL",Hampshire,"BH25 6JL","0740 238 4943",,"Building and Construction",Contract,,,IDVERDE,"Driver Gardener",s3://attachments.broadbean.com/218320133
194063843,"Bida Alin Vasile",bida_vasile@yahoo.com,2019-10-29T15:46:26,cvlibrary,"89 christchurch avenue, london, MIDDLESEX, ha3 8lz",Middlesex,"ha3 8lz","0740 519 4715","0208 621 9049","Building and Construction",Permanent,,,"A.B.S Contracts LTD",CARPENTER,s3://attachments.broadbean.com/194063843
309145979,"Colin Gallimore",gangstarasta1976@gmail.com,2019-10-29T16:01:10,gojobsite,"Pumpkin House, 101 - 102 St Marys Street, Southampton, Hampshire, SO14 1PF",Hampshire,"SO14 1PF","0753 491 2733",,"Building and Construction",Permanent,,,,Cleaner,s3://attachments.broadbean.com/309145979
309147875,"Hassan Lami",unknown_email@gojobsite-67109732-resourcinggroup.com,2019-10-29T16:13:10,gojobsite,,,,,,,,,,"Farhad Gange Heating","Plumber and Gas engineer",s3://attachments.broadbean.com/309147875
309166039,"Bryan Lane",blusplumbingsolutions@hotmail.com,2019-10-29T18:32:07,cvlibrary,"Bryan Lane, Image, KT10 8DN",Surrey,"KT10 8DN","0777 214 6252",,"Building and Construction",Temporary,,,"Blus Plumbing solutions",Plumber,s3://attachments.broadbean.com/309166039
309157593,"Heather Cummins",hrhobbs71@gmail.com,2019-10-29T17:21:48,careerbuilder,"1818 SEALY STREET, GALVESTON, TEXAS",,,,"832 631 5897","Property and Housing",Permanent,,,"Wal-Mart Stores, Inc","Assistant Manager",s3://attachments.broadbean.com/309157593
147941849,"Edward Williams",ed.williamsqs@sky.com,2019-10-29T17:06:24,cvlibrary,"[, Image, SURREY","British Columbia","RH9 8BJ","0739 111 9522","0188 367 4838","Property and Housing",Contract,,,"RI Works Ltd","quantity surveyor",s3://attachments.broadbean.com/147941849
309156879,"Miss Sukhvinder Sodhi",sukhvindersodhi@hotmail.com,2019-10-29T17:17:21,gojobsite,"42 Compton Road, Coventry, CV6 6GL",Warwickshire,"CV6 6GL","0789 046 0619","0247 668 1998","Call Centre and Customer Service",Contract,,,"Pearl Linguistics Ltd","Interpreter and Translator",s3://attachments.broadbean.com/309156879
309158339,"Daniel James Hickman",danhickman0590@gmail.com,2019-10-29T17:28:11,resourcing_group,"12 Weddell Wynd, Bilston, WV148UH","West Midlands",WV148UH,"0752 696 4980",,"Building and Construction",Contract,,,"William Gibbons","Guillotine Operator",s3://attachments.broadbean.com/309158339
289499709,"John Olaitan",unknown_email@cvlibrary-16471989-resourcinggroup.com,2019-10-29T08:44:16,cvlibrary,"79 Charlton Road, Edmonton London, N9 8HP",London,"N9 8HP",,,"Real Estate and Property",Permanent,,,,,s3://attachments.broadbean.com/289499709
309085667,"Mimi Vu",mimittvu@gmail.com,2019-10-29T09:48:41,reed,"London, SE5 7NA",London,"SE5 7NA","0758 502 1190",,Accountancy,Temporary,,,"Noni B Group Pty Ltd",,s3://attachments.broadbean.com/309085667
309083599,"G Fernandes",fernsgoldf@yahoo.com,2019-10-29T09:35:48,reed,"4 Almond Close, image, RH11 8ED","West Sussex","RH11 8ED","0772 255 8651","44(0) 129 340 4332",,,,,"TUV UK Ltd","Engineer Surveyor",s3://attachments.broadbean.com/309083599
110435977,"Wilma Kelly",wilmakelly@msn.com,2019-10-29T08:56:24,cvlibrary,"Image, EH25 9TN",Midlothian,"EH25   9TN","0736 822 2615","0131 283 5123","Admin and Secretarial",Contract,,,Pertemps,"File Preparation Assistant",s3://attachments.broadbean.com/110435977
309084409,"Moses Mwamba",temwanimoses@gmail.com,2019-10-29T09:40:44,gojobsite,"P.O BOX 32379, CHANDA",,,"097 649 4851",,"Public Sector and Government",Temporary,,,"MINISTRY OF COMMUNIITY DEVELOPMENT AND SOCIAL WELFARE","SOCIAL WORKER",s3://attachments.broadbean.com/309084409
309073921,"Kris Kent",kriskentmk@hotmail.com,2019-10-29T08:25:45,gojobsite,", NN12 7QE",Northamptonshire,"NN12 7QE",,"0739 933 4088","Building and Construction",Permanent,,,Groundworker,,s3://attachments.broadbean.com/309073921
309088011,"Claire Sawyer",claire.sawyer71@live.co.uk,2019-10-29T10:03:11,resourcing_group,DY10,Worcestershire,DY10,"0794 034 0985",,"Building and Construction",Permanent,,,"Ignis Group Ltd","Operations Manager",s3://attachments.broadbean.com/309088011
308945087,"Gary Brasnell",gary.brasnell@gmail.com,2019-10-28T12:55:42,gojobsite,"24 Oxhill Close, Redditch, Worcestershire",,,"0741 200 2028","0152 743 5943",,,,,"E-Lites (Zandera Ltd)",,s3://attachments.broadbean.com/308945087
308956427,"Madina Bamba",mdnbmb@gmail.com,2019-10-28T14:05:37,cvlibrary,,,,,,"Not for Profit and Charities",Temporary,,,,"Nursery assistant",s3://attachments.broadbean.com/308956427
308955613,"Marufa Zaman",marufa.zaman333@gmail.com,2019-10-28T14:00:19,careerbuilder,", Bronx, NY, 10462",,10462,,"929 431 9543","Building and Construction",Permanent,,,,"Architectural Intern",s3://attachments.broadbean.com/308955613
306202799,"Dave Kandial",davekandial@hotmail.com,2019-10-28T14:21:30,cvlibrary,"13 Sandy Way, Surrey, KT12 1BL",Surrey,"KT12 1BL","0797 683 4011","0193 225 3752","Building and Construction",Temporary,,,"EUSTON STATION & HS2",Electrician,s3://attachments.broadbean.com/306202799
308966167,"Oliver Holbrook",olholbrook@gmail.com,2019-10-28T15:03:18,cvlibrary,,,,"44 750 440 2192",,,,,,"Skidmore, Owings & Merrill LLP","Marketing Coordinator",s3://attachments.broadbean.com/308966167
307242369,"Douglas Miller",douglasmiller.pe.tx@gmail.com,2019-10-28T15:13:06,careerbuilder,"4212 San Felipe Rd, Suite 367, Houston, TX, 77027-2902",,77027-2902,"(832) 552 2423","(281) 898 4069","Property and Housing",Permanent,,,,"MANAGING DIRECTOR",s3://attachments.broadbean.com/307242369
292700299,"Erti Velaj",ertivelaj@gmail.com,2019-10-28T15:42:50,gojobsite,", London",,,"0755 448 0013","0755 448 0013","Design and Creative",Permanent,,,,"CAD DESIGNER",s3://attachments.broadbean.com/292700299
305576917,"Kerem Aykut",keremmaykutt@gmail.com,2019-10-28T15:57:12,resourcing_group,,,,,,"Building and Construction",Contract,,,"Kerem Aykut Summary",Director,s3://attachments.broadbean.com/305576917
308975547,"David Burton",DJBurtonelectrical@outlook.com,2019-10-28T15:58:32,cvlibrary,"138. Ruden Way, Epsom, Surrey, KT17 3LP",Surrey,"KT17 3LP","0752 586 0693",,,,,,"OH Projects","Site Manager",s3://attachments.broadbean.com/308975547
309070339,"Elliot Kuehlmann-Hall",elliotkh@live.com.au,2019-10-29T07:58:57,reed,"29 Hazelbourne Road, Clapham South London",,,"+44 7923 243726",,,,,,"Radii Partitioning Ltd","Contracts Manager",s3://attachments.broadbean.com/309070339
309125693,"Clive Thompson",tompa1999@hotmail.co.uk,2019-10-29T13:49:12,cvlibrary,"43 well bank road, Washington, Ne371Nw","Tyne and Wear",Ne371Nw,"0771 861 9592",,"Building and Construction",Temporary,,,,,s3://attachments.broadbean.com/309125693
309127605,"Nazifa Anjum Uddin",anjum.97@live.co.uk,2019-10-29T14:01:48,cvlibrary,,,,"0794 749 8795",,"Not for Profit and Charities",Temporary,,,"CITIZENS ADVICE WITNESS SERVICE | ACCREDITED COURT VOLUNTEER",,s3://attachments.broadbean.com/309127605
309098297,"John Houston",samhouston28@outlook.com,2019-10-29T11:03:58,cvlibrary,"Image, BB7 4AU",Lancashire,"BB7 4AU","0777 911 5738",,"Building and Construction",Temporary,,,"CLM Projects Ltd",,s3://attachments.broadbean.com/309098297
309100029,"Ashton Vidal",vidalplumbing@hotmail.co.uk,2019-10-29T11:14:45,cvlibrary,"55 Wolsey Avenue, Image, London, E17 6RE",Essex,"E17 6RE","0793 191 5350",,,,,,,Plumber,s3://attachments.broadbean.com/309100029
309138523,"Henrietta Udeozor",henriettaadakuudeozor@yahoo.co.uk,2019-10-29T15:12:28,cvlibrary,London,,,"0795 677 2591","07 939 653 5491","Admin and Secretarial",Permanent,,,"Tradewind Recruitment",,s3://attachments.broadbean.com/309138523
309138555,"Patrick Flanagan",paddyflan1@hotmail.com,2019-10-29T15:12:45,cvlibrary,"[, Image, SE15 5TE",London,"SE15 5TE","0783 790 5223",,,,,,"S WALSH & SONS","Construction manager",s3://attachments.broadbean.com/309138555
309306259,"Viktoria Jona",viktoria.jona@gmail.com,2019-10-30T13:07:06,gojobsite,"32 Braunston House, Wembley",,,,"0781 840 3602",,,,,"Conran and Partners Ltd",,s3://attachments.broadbean.com/309306259
309330109,"Lynne Fulton",lynnefh59@gmail.com,2019-10-30T14:03:23,gojobsite,"Coventry, CV4 9BZ","West Midlands","CV4 9BZ","0790 729 1012",,"Call Centre and Customer Service",Contract,,,"ALS Environmental",Administrator,s3://attachments.broadbean.com/309330109
309309493,"Rhamsi Alkad",rhamsi@hotmail.com,2019-10-30T13:15:10,gojobsite,"4 The Green, Wrenthorpe, WF2 0JP","West Yorkshire","WF2 0JP","0752 761 7349",,"Building and Construction",Permanent,,,,"Onsite/ Domestic Labourer",s3://attachments.broadbean.com/309309493
309320487,"alistair kedge",ali.kedgel@gmail.com,2019-10-30T13:39:59,gojobsite,"12 Brampton Rise, Dunstable, Beds, LU6 3BY",Bedfordshire,"LU6 3BY","787 962 2451","0158 266 7536",,,,,"Smart insulations","Field Sales Representative/Marketing Manager",s3://attachments.broadbean.com/309320487
309321467,"tyler cameron",tylercameron@live.co.uk,2019-10-30T13:42:12,gojobsite,"2 Chandler place, Leighton Buzzard",,,"0793 958 5263",,,,,,,"general labourer",s3://attachments.broadbean.com/309321467
309326603,"Alice Wilson",thealicefiles@hotmail.com,2019-10-30T13:53:51,gojobsite,"Flat 18 Anchor Terrace*, 3-13 Southwark Bridge Rd, London, SE1 9HQ",London,"SE1 9HQ","0794 496 9217",,,,,,"Finton House School","Personal Assistant",s3://attachments.broadbean.com/309326603
309318697,"Steven Hannam",stevehannam@live.co.uk,2019-10-30T13:36:14,gojobsite,"Road, Flamstead, AL38EE",Hertfordshire,AL38EE,"0784 929 3117",,,,,,"Ventnor Botanic Gardens","Apprentice Gardener",s3://attachments.broadbean.com/309318697
309266107,"Russell Pibworth",pillok4987@gmail.com,2019-10-30T11:29:14,reed,"|, London",,,"0793 124 9783",,,,,,,Homemaker,s3://attachments.broadbean.com/309266107
230905991,"Michael Carter",mike.carter@hotmail.co.uk,2019-10-30T11:34:59,reed,,,,"0784 170 6672",,"Building and Construction",Permanent,,,"Owls Hall Environmental Limited","Project Manager",s3://attachments.broadbean.com/230905991
309267277,"junior sintim",j.sintim@hotmail.co.uk,2019-10-30T11:36:40,reed,"42 Bolton walk , DURHAM ROAD, London, N7 7RW",London,"N7 7RW","0780 919 3260",,,,,,"Addison Lee","Parts Supervisor",s3://attachments.broadbean.com/309267277
309267369,"Milan Chochov",melanigri@abv.bg,2019-10-30T11:37:21,reed,", London",,,"0774 628 8558",,,,,,,"Car mechanic",s3://attachments.broadbean.com/309267369
309268681,"Nathan Leonardi",nsleonardi@gmail.com,2019-10-30T11:39:33,cvlibrary,"56 Longridge Rd. London. Flat 4 SW5 9SH",,,"+44 7491 137397",,,,,,"FL INTERIORS; FARGAIN","Designer, Freelancer",s3://attachments.broadbean.com/309268681
294216411,"Krystle Denise-Ama",krystle.denise@hotmail.co.uk,2019-10-30T11:40:13,resourcing_group,Twickenham,,,"0749 651 0616",,"Building and Construction",Permanent,,,,"Document Controller/Site Administrator",s3://attachments.broadbean.com/294216411
309269817,"Jade Smith",jadecesmith31@gmail.com,2019-10-30T11:41:33,reed,"The Glasshouse, 15 Elmbridge Hall, Fyfield, Essex, CM5 0TN",Essex,"CM5 0TN","0754 046 7730",,"Admin and Secretarial",Permanent,,,"Fairfield MINI","Sales Executive",s3://attachments.broadbean.com/309269817
309271145,"Shanelle Martin",shanelle.e.martin@outlook.com,2019-10-30T11:43:54,reed,"Flat 1, Block N, Abbey Orchard Street, London, London, SW1P 2DN",London,"SW1P 2DN","0775 900 6884",,,,,,"First Aid Trained",,s3://attachments.broadbean.com/309271145
309360057,"Miranda Gayle",Jennifer.rafter@anglia.ac.uk,2019-10-30T15:20:58,cvlibrary,"Chelsmford Campus, Bishop Hall Lane, Chelmsford, London, CM1 1SQ",Essex,"CM1 1SQ","0790 370 1461","0124 549 3131",,,,,"The Scouts Association","Duty Safeguarding Officer",s3://attachments.broadbean.com/309360057
309364339,"Annie Strachan",Anniefstrachan@gmail.com,2019-10-30T15:32:07,cvlibrary,,,,"44(0) 777 563 6583",,,,,,"Studio RHE","Studio Coordinator & PA",s3://attachments.broadbean.com/309364339
309365811,"Lucy Colbert",lucy.colbert@yahoo.com,2019-10-30T15:36:27,cvlibrary,,,,,"0797 903 1548",,,,,,,s3://attachments.broadbean.com/309365811
309365915,"Paul Ashley",paul.ashley747@ntlworld.com,2019-10-30T15:36:48,cvlibrary,":, Image, PE29 1NF",Cambridgeshire,"PE29 1NF","0771 039 4077","0148 035 1550",,,,,"AIM Composites","Quality Engineer",s3://attachments.broadbean.com/309365915
309337011,"Aman Faruk",aman_faruk@hotmail.co.uk,2019-10-30T14:21:30,cvlibrary,"Candidate Details, Location, Greater London",,,,,"Call Centre and Customer Service",Contract,,,,,s3://attachments.broadbean.com/309337011
306553359,"John Moorcroft",johnmoorcroft00@gmail.com,2019-10-10T11:11:14,resourcing_group,"29 Dukes Close, Petersfield, Hants, GU32 3QZ",Hampshire,"GU32 3QZ","0790 812 0041","0173 030 1198","Building and Construction",Temporary,,,"Best Connection","Agency Worker",s3://attachments.broadbean.com/306553359
291984185,"Nicholas Richardson",richardson.nicholas@ymail.com,2019-10-10T13:38:58,gojobsite,"South, London",,,"0798 331 3355",,"Admin and Secretarial",Temporary,,,"Premier Cad","Mailroom Assistant",s3://attachments.broadbean.com/291984185
259893329,"Rebekah Dawson",rg.dawson@hotmail.com,2019-10-10T13:47:15,gojobsite,"/South, London",,,"0786 486 5830",,"Admin and Secretarial",Permanent,,,"Notting Hill Genesis","Team Coordinator",s3://attachments.broadbean.com/259893329
306593319,"Colin Begg",cjbegg@outlook.com,2019-10-10T15:26:38,cvlibrary,"Image, M13 0EP","Greater Manchester","M13 0EP","0740 137 7929",,"Building and Construction",Permanent,,,"MORGAN SINDALL","DOCUMENT CONTROLLER",s3://attachments.broadbean.com/306593319
306589189,"Oksana Kozba",oksanakozba@gmail.com,2019-10-10T15:58:56,careerbuilder,"2678 Ocean Ave. Apt. 2J, Brooklyn, New York, 11229",,11229,,"(646) 257 0890","Real Estate and Property",Permanent,,,"Yoga Smoga Inc",,s3://attachments.broadbean.com/306589189
306598685,"Jon Groves",jon_groves@msn.com,2019-10-10T16:03:44,cvlibrary,"82 Packer Avenue, Leicester, LE3 3QG",Leicestershire,"LE3 3QG","0758 084 3654",,"Design and Creative",Permanent,,,,,s3://attachments.broadbean.com/306598685
306599933,"Ben Colley",bencolley18@yahoo.co.uk,2019-10-10T16:13:50,reed,"3 Priory Walk, Bracknell, Berkshire, RG129JT",Berkshire,RG129JT,"0775 317 0559","0134 430 1357","Building and Construction",Temporary,,,"The Tes Group

Multi Skilled Carpenter",,s3://attachments.broadbean.com/306599933
306527359,"Meera Shah",meera_shah70@hotmail.com,2019-10-10T08:39:34,cvlibrary,"MBA, CIMA",,,"44(0) 774 831 3488",,"Public Sector and Government",Contract,,,"Lloyds Bank","PROGRAM MANAGER",s3://attachments.broadbean.com/306527359
304910593,"Jon race",jonrace05@gmail.com,2019-10-10T08:49:18,resourcing_group,Northfield,,,"0794 786 5109",,"Building and Construction",Permanent,,,,,s3://attachments.broadbean.com/304910593
304833807,"Madalina Riglea",madalinaelenariglea@yahoo.com,2019-10-10T09:37:44,reed,"3 Goldcrest Court, 3 Raven Close, London, NW9 5BJ",London,"NW9 5BJ","0746 335 3253",,Accountancy,Temporary,,,"JOS Property Services Ltd","Accounts Assistant",s3://attachments.broadbean.com/304833807
306527821,"Santana Louisy",louisybernard@yahoo.com,2019-10-10T08:43:02,reed,"91 Grove Park, Colindale, London, NW9 0JA",London,"NW9 0JA","0785 281 1941",,"Admin and Secretarial",Permanent,,,"Harrow Council Civic Centre","Senior Business Support Officer",s3://attachments.broadbean.com/306527821
306602117,"Solongo Gal",sooko0626@gmail.com,2019-10-10T16:30:28,reed,"1]Solongo Galbaatar",,,"44(0) 773 192 4426",,"Human Resources and Personnel",Contract,,,"Redpath Mongolia",HRM,s3://attachments.broadbean.com/306602117
306604317,"Tiffany Tyler",tiffanys2001@hotmail.com,2019-10-10T16:48:22,reed,", Wickford, Essex",,,"0796 788 5369",,"Admin and Secretarial",Permanent,,,"Smith and Williamson LLP","Partners Secretary",s3://attachments.broadbean.com/306604317
305826003,"Obiageli Dike",obidike@hotmail.com,2019-10-10T16:53:06,gojobsite,"186 Marmadon Road, London, SE18 1EQ",London,"SE18 1EQ","0786 556 4781",,"Admin and Secretarial",Permanent,,,"W K Webster & Co","Trainee Case Handler",s3://attachments.broadbean.com/305826003