Id,Candidate,"E-Mail Address","Application date / time","Latest Source","Address Line 1",County,Postcode,"Mobile Number","Home Phone Number",Industry,"Contract / Job Type Required","Current Status","Available Date","Current Employer","Current Job Title","Attachment URL"
346481903,"Yarden Brikman",ybrikman@me.com,2019-09-22T11:50:15,gojobsite,"46A HaRishonim st. Haifa, 11 April",,,,"97 254 475 7988","Recruitment Consultancy",Temporary,,,,"art director",s3://attachments.broadbean.com/346481903
346482199,"Qasim R",Qraza89@hotmail.co.uk,2019-09-23T13:51:18,gojobsite,"_, Qasim",,,"44 741 444 6636",,"Recruitment Consultancy",Temporary,,,"Krazy Kopy","Graphic Designer",s3://attachments.broadbean.com/346482199
346482201,"Bhadrika parmar",bhadrika06@gmail.com,2019-09-23T13:34:56,cvlibrary,"[, Image",,,"0795 468 3478",,"Recruitment Consultancy",Temporary,,,"J B Daverns & Co","Office Assistant/Marketing Assistant",s3://attachments.broadbean.com/346482201
346482019,"Emma Simonsen",emma@esim.dk,2019-09-22T21:34:58,reed,"620 Cardinal Building, Hayes, UB34FE",London,UB34FE,"0773 397 0716",,"Recruitment Consultancy",Temporary,,,"Maxim World Internship","Mcdonalds Crew Member",s3://attachments.broadbean.com/346482019
346481533,"Fofe Papadopoulou",fofepapadopoulou@gmail.com,2019-08-28T14:19:26,gojobsite,", Watford, WD19 4JF",Hertfordshire,"WD19 4JF","44(0) 747 271 4787",,"Recruitment Consultancy",Permanent,,,"Yellow Brick Group","Head of  Marketing & Growth",s3://attachments.broadbean.com/346481533
346482219,"Isabel Corrales",isabel13cor@gmail.com,2019-09-23T16:00:47,cvlibrary,,,,"44 754 913 1669",,"Recruitment Consultancy",Temporary,,,,,s3://attachments.broadbean.com/346482219
346482547,"Tybert Tybert",tybertmhlanga@hotmail.co.uk,2019-09-24T22:23:38,gojobsite,"MHLANGA, CT9 3XQ",Kent,"CT9 3XQ","0747 033 6650",,"Recruitment Consultancy",Temporary,,,Freelancing,,s3://attachments.broadbean.com/346482547
346482579,"TalkMovies247 Daniel",talkmovies247@gmail.com,2019-09-25T08:45:40,gojobsite,"27 Gardenia Rd, Bromley, Kent, BR1 2FH",Kent,"BR1 2FH","0794 070 8357",,"Recruitment Consultancy",Temporary,,,,,s3://attachments.broadbean.com/346482579
346482465,"Reece Hagley",reece_hagley96@hotmail.co.uk,2019-09-24T13:25:02,cvlibrary,"17 Acacia Avenue, Hornchurch, Essex, RM12 4EW",London,"RM12 4EW","0751 745 8415",,"Recruitment Consultancy",Temporary,,,,"Assistant Artworker",s3://attachments.broadbean.com/346482465
346482419,"Jacob Fulton",jacobfulton@msn.com,2019-09-24T11:47:51,gojobsite,"4 5 Craignair Avenue, Patcham, Sussex, BN18UG","East Sussex",BN18UG,"0779 532 0228","0127 350 5796","Recruitment Consultancy",Temporary,,,,"graphic  designer",s3://attachments.broadbean.com/346482419
346482527,"Shedana Grossett",shedanagrossett@gmail.com,2019-09-24T21:01:47,gojobsite,"ShedanaGrossett., co.",,,"0753 449 6998",,"Recruitment Consultancy",Temporary,,,"Ivy Preparatory School","Teaching Assistant",s3://attachments.broadbean.com/346482527
346482521,"Fei Liang",786440232@qq.com,2019-09-24T19:12:19,cvlibrary,"[, Image",,,,"786 440 232","Recruitment Consultancy",Temporary,,,,"Brand Designer",s3://attachments.broadbean.com/346482521
346482633,"Francesco Mancini",f.mancinidesign@gmail.com,2019-09-25T13:10:53,gojobsite,,,,,"39 349 592 7942","Recruitment Consultancy",Temporary,,,,,s3://attachments.broadbean.com/346482633
346482389,"Parisa Karoonian",parisakaroonian@outlook.com,2019-09-25T09:58:57,gojobsite,,,,,,"Recruitment Consultancy",Temporary,,,,,s3://attachments.broadbean.com/346482389
346481991,"Wera -",93wera@gmail.com,2019-09-22T18:27:21,gojobsite,,,,"0785 666 9200",,"Recruitment Consultancy",Temporary,,,,"Social Media Manager Intern",s3://attachments.broadbean.com/346481991
346481971,"Cat Gollifer",catgollifer.design@gmail.com,2019-09-22T18:00:51,reed,,,,"0771 391 6580",,"Recruitment Consultancy",Temporary,,,"Product Development Internship",,s3://attachments.broadbean.com/346481971
346482177,"Dane Williams",danehwilliams@gmail.com,2019-10-01T10:02:02,cvlibrary,"18 MORGAN COURT, BATTERSEA HIGH STREET, BATTERSEA, LONDON, SW11 3HU",London,"SW11 3HU","0793 112 8077",,"Recruitment Consultancy",Temporary,,,"DANE HAYDEN","Graphic Designer",s3://attachments.broadbean.com/346482177
346483059,"Amy wakefield",amywakefield22@hotmail.com,2019-09-29T22:55:50,cvlibrary,", Berkshire, RG41 4UT",Berkshire,"RG41 4UT","0790 293 4820","0118 989 4228","Recruitment Consultancy",Temporary,,,"People Leisure",Receptionist,s3://attachments.broadbean.com/346483059
346482657,"Mie Sadaka",msadaka3003@gmail.com,2019-09-30T00:07:31,gojobsite,"6 The Fairway, East Acton, London, W3 7PN",London,"W3 7PN","0750 084 7860","0208 749 7341","Recruitment Consultancy",Temporary,,,"Amnick Social Enterprise","Web & Graphic Designer",s3://attachments.broadbean.com/346482657
346483075,"Nikolaos Dervisis",nickosdervisis@gmail.com,2019-09-30T05:56:24,cvlibrary,"Hunsdon Rd. 33, London, SE15 5RD",London,"SE15 5RD",,"0739 431 2520","Recruitment Consultancy",Temporary,,,,,s3://attachments.broadbean.com/346483075
346483045,"Bright Appiah",brightappiah95@gmail.com,2019-09-29T20:54:24,cvlibrary,London,Kent,,"0753 348 7578",,"Recruitment Consultancy",Temporary,,,"TGM Radio UK","Graphic Designer, Video Editor",s3://attachments.broadbean.com/346483045
346483111,"Shivanjali Verma",shivanjaliverma8@gmail.com,2019-09-30T14:57:58,gojobsite,,,,,,"Recruitment Consultancy",Temporary,,,"CONTACT ME","Design Intern",s3://attachments.broadbean.com/346483111
346482077,"JiWoon Kwak",k3j19w@gmail.com,2019-09-30T15:45:42,reed,", UK (), ABBAMART (Cosmetic Brand), in, London, SW11",London,SW11,,"44 736 646 8786","Recruitment Consultancy",Temporary,,,,,s3://attachments.broadbean.com/346482077
346484677,"Jack Glidewell",jackglidewell96@gmail.com,2020-02-06T16:55:18,gojobsite,"21 Freeman Close, Swanscombe, Kent, DA10 1BY",Kent,"DA10 1BY","0753 156 6195","0132 242 3638","Recruitment Consultancy",Temporary,,,"Yamagata University","assistant language teacher",s3://attachments.broadbean.com/346484677
346484707,"Jaype Omotosho",philli_ps@hotmail.com,2020-02-10T10:30:07,gojobsite,,,,"0790 362 2193",,"Recruitment Consultancy",Temporary,,,"Premier Workplace Services","Business Development Executive",s3://attachments.broadbean.com/346484707
346484783,"John Swayze",johnhankswayze@gmail.com,2020-02-24T02:27:16,gojobsite,,,,,,"Recruitment Consultancy",Temporary,,,,,s3://attachments.broadbean.com/346484783
346484793,"Zineb Serroukh",zserroukh@medialawinternational.com,2020-03-04T18:03:45,gojobsite,,,,"0744 652 5299",,"Recruitment Consultancy",Temporary,,,"Fitch Ratings","Financial Editor",s3://attachments.broadbean.com/346484793
346484169,"Fattmh Badr",f.badr94@gmail.com,2019-10-15T19:29:24,gojobsite,"982 Mehwar elkafrawy 6 October city, Bayswater, London, W2 4DJ",London,"W2 4DJ","0743 519 6510","200 106 037 2510","Recruitment Consultancy",Temporary,,,,Freelancer,s3://attachments.broadbean.com/346484169
346484171,"Borislav Aleksandrov",bork0o10@gmail.com,2019-10-15T18:41:39,reed,"UNITED KINGDOM LONDON S, W15",London,W15,"0754 871 8670",,"Recruitment Consultancy",Temporary,,,,Cutter,s3://attachments.broadbean.com/346484171
346484361,"Aisha Bukhari",aisha.buk@hotmail.com,2019-10-18T08:34:41,gojobsite,,,,"0747 902 0925",,"Recruitment Consultancy",Temporary,,,"Sitting & Befriending",Carer,s3://attachments.broadbean.com/346484361
346484353,"Flutura Hoxha",fluturahh@hotmail.com,2019-10-17T20:16:09,cvlibrary,", Enfield, London",,,"0773 375 2415",,"Recruitment Consultancy",Temporary,,,,"Care Coordinator",s3://attachments.broadbean.com/346484353
346484335,"Morgane Philbert",morgane.philbert.graphiste@gmail.com,2019-10-17T15:13:12,reed,"6 Grenville Place, London, SW7 4RT",London,"SW7 4RT","44 770 609 4761",,"Recruitment Consultancy",Temporary,,,"ITALIEN STREET FOOD",,s3://attachments.broadbean.com/346484335
346484293,"Bryony Horne",bhorne16@talktalk.net,2019-10-16T22:23:04,gojobsite,,,,"0773 033 3527",,"Recruitment Consultancy",Temporary,,,"Question Journal Issue 3",,s3://attachments.broadbean.com/346484293
346484443,"Martins Strals",martin.strals@gmail.com,2020-01-09T10:32:04,gojobsite,"106 Fircroft Road, London, SW17",London,SW17,"0782 876 6992",,"Recruitment Consultancy",Permanent,,,FTC,"Marketing and Communications Consultant",s3://attachments.broadbean.com/346484443
346484417,"Holly O'Brien",hollyobrien9@googlemail.com,2020-01-08T19:19:41,gojobsite,"Finance, B2B",,B2B,"0775 422 6284",,"Recruitment Consultancy",Permanent,,,"Century Capital Lenders Mayfair","Head of Marketing",s3://attachments.broadbean.com/346484417
346484167,"Alessandra Cuccu",alessandra.cuccu@hotmail.it,2019-10-15T19:21:39,cvlibrary,"Flat 5, Donkin house, Rennie, London, SE16 3PQ",London,"SE16 3PQ","0747 698 3572",,"Recruitment Consultancy",Temporary,,,,"Shop floor assistant",s3://attachments.broadbean.com/346484167
346484985,"Arinze Imachukwu",arinzo@hotmail.co.uk,2020-03-14T09:49:10,gojobsite,"123 BEACONS FIELD ROAD, CANNING TOWN, LONDON, E16 4HT",London,"E16 4HT","0741 549 3738",,"Recruitment Consultancy",Temporary,,,PEARSON,"GRAPHIC DESIGNER & MARKETING MANAGER",s3://attachments.broadbean.com/346484985
346484939,"Barry Garwood",barry@mousetrap-design.co.uk,2020-03-13T13:40:54,gojobsite,"40 Cotefield Drive, Leighton Buzzard, Beds, LU7 3DS",Bedfordshire,"LU7 3DS","0791 704 2499",,"Recruitment Consultancy",Temporary,,,,"Designer/Creative Artworker",s3://attachments.broadbean.com/346484939
346484821,"Xavier Brown",xavier.brown@hotmail.co.uk,2020-03-15T14:39:45,gojobsite,", Woodford Green, Essex",London,,"0795 843 5861",,"Recruitment Consultancy",Temporary,,,"Mono Mono LTD","Video Editor",s3://attachments.broadbean.com/346484821
346485021,"Charlie Kellie",c.k.randall74@gmail.com,2020-03-14T18:18:21,gojobsite,"Flat 2, 2 High Street, Grantham, Lincolnshire, NG31 6PN",Lincolnshire,"NG31 6PN","0799 989 3321",,"Recruitment Consultancy",Temporary,,,"Tesco Stores Ltd","Delicatessen Counters / Customer Assistant",s3://attachments.broadbean.com/346485021
346485023,"Pablo Iglesias",piglesiasglez@gmail.com,2020-03-14T21:10:22,gojobsite,,,,,"3465 065 0368","Recruitment Consultancy",Temporary,,,"Pablo Iglesias González","Multimedia Designer",s3://attachments.broadbean.com/346485023
346484923,"Laila A",lailamiriam86@gmail.com,2020-03-11T03:39:37,gojobsite,"62 Montague Square, London, SE15 2LR",London,"SE15 2LR","0777 411 7000",,"Recruitment Consultancy",Temporary,,,Mencap,"Senior Wills & Trusts Officer",s3://attachments.broadbean.com/346484923
346484993,"Archana Arjun",archana.mohan87@gmail.com,2020-03-14T09:47:03,gojobsite,"Flat 4, Maltby House, Maltby Street, SE1 3PD",London,"SE1 3PD","44 751 572 8848",,"Recruitment Consultancy",Temporary,,,"Al Hooth Group","Senior Graphic Designer",s3://attachments.broadbean.com/346484993
346484907,"Paul Giles",pgiles602@gmail.com,2020-03-09T19:00:01,gojobsite,,,,"0783 075 1662",,"Recruitment Consultancy",Temporary,,,,,s3://attachments.broadbean.com/346484907
346485255,"Adeyemi Ogundimu",adeyemiogundimu@live.co.uk,2020-03-16T18:58:33,gojobsite,"A: , Edgware, London",London,,"0793 193 7686",,"Recruitment Consultancy",Temporary,,,,"Freelance Graphic Designer",s3://attachments.broadbean.com/346485255
346485063,"Adrianna Thomas",adrianna899@yahoo.co.uk,2020-03-14T23:31:01,gojobsite,"Adrianna899yahoo, co.",,,,,"Recruitment Consultancy",Temporary,,,"Patternbank Studio","Textiles Designer",s3://attachments.broadbean.com/346485063
346485067,"Linda Zacharia",liontiazacharia@gmail.com,2020-03-15T12:54:17,gojobsite,,,,"0796 115 0550",,"Recruitment Consultancy",Temporary,,,"Freelance Creative Contracts",,s3://attachments.broadbean.com/346485067
346485089,"John Matthews",elethan@hotmail.co.uk,2020-03-15T18:53:45,gojobsite,"126 QUEENSWOOD GARDENS, WANSTEAD, LONDON, E11 3SG",London,"E11 3SG","0775 345 8472",,"Recruitment Consultancy",Temporary,,,"Haversham Publishing","Art editor",s3://attachments.broadbean.com/346485089
346482543,"Haseeb Majeed",haseeb316@hotmail.co.uk,2020-03-15T12:27:44,gojobsite,"20 Dimsdale drive, London, NW9 8HT",London,"NW9 8HT","0790 909 2310",,"Recruitment Consultancy",Temporary,,,Joes,"HOUSE GRAPHIC CO-ORDINATOR",s3://attachments.broadbean.com/346482543
346485351,"Nina Czerniak-Copping",N.copping@live.co.uk,2020-03-18T13:20:07,gojobsite,"19 Wingfield Court, 4 Newport Avenue, London, E14",London,E14,"0771 613 9834",,"Recruitment Consultancy",Temporary,,,"Bywaters (Leyton) Ltd","Business Development Coordinator/Account 
Manager",s3://attachments.broadbean.com/346485351
346485367,"Esther Gamito",gamitoesther@gmail.com,2020-03-18T18:08:23,gojobsite,,,,,,"Recruitment Consultancy",Temporary,,,"Lark & Berry Jewellery",,s3://attachments.broadbean.com/346485367
346485353,"Hannah Pellatt",hannahpellattdesign@gmail.com,2020-03-18T16:24:28,gojobsite,,,,"44) 795 047 5661",,"Recruitment Consultancy",Temporary,,,"JUNIOR DESIGNER / Bamboo Creative",,s3://attachments.broadbean.com/346485353
346485393,"Phiduance Matavire",mphiduance@gmail.com,2020-03-18T23:16:28,gojobsite,", Harare",,,"+263 71 780 6932",,"Recruitment Consultancy",Temporary,,,"TM Pick N Pay","Till operator/Shelf Packer",s3://attachments.broadbean.com/346485393
346485427,"Patrick Wiseman",patrick.wiseman28@gmail.com,2020-03-19T15:45:49,gojobsite,,,,"0792 740 7121",,"Recruitment Consultancy",Temporary,,,ITR,"Sports Writer",s3://attachments.broadbean.com/346485427
346485967,"Peter Sands",info@petersands.co.uk,2020-04-01T12:14:30,gojobsite,ESPY,,,"44(0) 791 225 6503",,"Recruitment Consultancy",Temporary,,,,"Graphic Designer & Tattoo Artist",s3://attachments.broadbean.com/346485967
346485629,"Kalum Welikala",kalumw@hotmail.com,2020-04-01T18:41:34,gojobsite,", Greenford, Middlesex",London,,"788 682 2240",,"Recruitment Consultancy",Temporary,,,"HEAD OF CREATIVE","STK  /  W ILEYFOX",s3://attachments.broadbean.com/346485629
346485937,"Alana Dwek",alanaisabellesarahdwek@gmail.com,2020-04-01T08:59:02,gojobsite,SARAH,,,"0797 910 6223",,"Recruitment Consultancy",Temporary,,,"The Book People","Digital Designer",s3://attachments.broadbean.com/346485937
346486209,"Jafor Abu",jafabu91@gmail.com,2020-04-07T21:37:26,gojobsite,,,,,,"Recruitment Consultancy",Temporary,,,,"Junior / Mid Graphic Designer",s3://attachments.broadbean.com/346486209
346486245,"Hannah Rose Coombs",hannahrcoombs@outlook.com,2020-04-08T17:07:52,gojobsite,,,,"44 777 683 3029",,"Recruitment Consultancy",Temporary,,,"Prosell Learning Ltd","Freelance Graphic Designer",s3://attachments.broadbean.com/346486245
346486189,"Jag Takhar",jagmindertakhar@yahoo.co.uk,2020-04-07T09:37:08,gojobsite,,,,"0788 147 0646",,"Recruitment Consultancy",Temporary,,,Harrods,"UI Designer",s3://attachments.broadbean.com/346486189
346486169,"Anette Hosszu",anettehosszu@gmail.com,2020-04-06T12:26:52,gojobsite,"148 Boleyn Road, Stoke Newington, London",London,,"440 774 551 6791",,"Recruitment Consultancy",Temporary,,,"House of Gharats",Intern,s3://attachments.broadbean.com/346486169
346481703,"Bartosz Wijasinski",Bartoszw@live.com,2019-09-20T17:51:25,cvlibrary,"154 Amersham Road, High Wycombe, Buckinghamshire, HP13 5AF",Buckinghamshire,"HP13 5AF","0774 331 4493",,"Recruitment Consultancy",Temporary,,,"Refill Stock","Tesco retail assistant",s3://attachments.broadbean.com/346481703
346481687,"Michael Olawuyi",unifiedypml@gmail.com,2019-09-20T15:55:39,cvlibrary,"88, broadwalk, Image, London, se3 8nd",London,"se3 8nd","07 388 875 7610","07 388 875 7610","Recruitment Consultancy",Temporary,,,Next,"stock room",s3://attachments.broadbean.com/346481687
346481577,"Luis Neves",neves.gui@gmail.com,2019-09-16T18:25:56,gojobsite,"|linkedin.com/in/luisgneves | , London",London,,"44 771 400 9376",,"Recruitment Consultancy",Permanent,,,,"SENIOR MARKETING MANAGER",s3://attachments.broadbean.com/346481577
346482805,"Barbara Kielak",bkielak@yahoo.com,2019-09-26T17:25:21,reed,"@, barbara",,,"44 754 253 2060",,"Recruitment Consultancy",Temporary,,,,,s3://attachments.broadbean.com/346482805
346481783,"Kieran Strong",strongkfs@gmail.com,2019-09-21T16:23:31,reed,"98 Granby road, London, SE9 1EL",London,"SE9 1EL","0754 769 8936",,"Recruitment Consultancy",Temporary,,,"The Columbo Group",Intern,s3://attachments.broadbean.com/346481783
346481761,"Andrew wong",andrewwty123@gmail.com,2019-09-21T12:26:04,reed,"Room 22, Nightingale House , 1 Princess Road, Liverpool, L8 1TG",Merseyside,"L8 1TG","44 751 822 8629",,"Recruitment Consultancy",Temporary,,,,,s3://attachments.broadbean.com/346481761
346481587,"James Maxwell",jamesmaxwell@outlook.com,2019-09-17T17:00:32,gojobsite,,,,"0793 907 1232",,"Recruitment Consultancy",Permanent,,,,,s3://attachments.broadbean.com/346481587
346482897,"Jamie Batty",jamiebatty98@gmail.com,2019-09-27T19:44:50,gojobsite,"29 St Martins close, Clacton, Essex, CO153NJ",Essex,CO153NJ,"0777 514 7953",,"Recruitment Consultancy",Temporary,,,"Get Advertising",,s3://attachments.broadbean.com/346482897
346482075,"Ron Kitoko",ron_sterling@hotmail.com,2019-09-28T14:01:41,reed,,,,"0744 491 6256",,"Recruitment Consultancy",Temporary,,,,"Freelance Graphic Designer",s3://attachments.broadbean.com/346482075
346482723,"Kristi Tasho",kristi.tasho96@gmail.com,2019-09-26T07:12:15,gojobsite,"Graphic Designer, CONTACT , Location - , Tirana",,,"+355 69 990 5465",,"Recruitment Consultancy",Temporary,,,"Agna Group","Graphic Designer",s3://attachments.broadbean.com/346482723
346482727,"Mariela Kashukeeva",mkashukeeva0@gmail.com,2019-09-26T08:28:53,cvlibrary,"[, Image",,,"0757 042 8289",,"Recruitment Consultancy",Temporary,,,"UWP Group","Digital Marketing Executive",s3://attachments.broadbean.com/346482727
346482741,"Poppy Anemogiannis",anemoneanimation@outlook.com,2019-09-26T10:44:07,reed,"|AnemoneAnimation., co.",,,"0778 972 2007",,"Recruitment Consultancy",Temporary,,,"Poppy's Map of Paxos. Creator","Owner & Designer/Illustrator",s3://attachments.broadbean.com/346482741
346482697,"Tahmina Shamim",contact.tahmina@gmail.com,2019-09-26T06:37:45,gojobsite,,,,,"4407 935 1970","Recruitment Consultancy",Temporary,,,"FREELANCE ILLUSTRATOR",,s3://attachments.broadbean.com/346482697
346482251,"Nicola Contini",nicolacontini@yahoo.it,2019-09-23T17:35:24,cvlibrary,,,,,"44 739 551 9156","Recruitment Consultancy",Temporary,,,,,s3://attachments.broadbean.com/346482251
346482279,"Daniel Fellows",danielfellows@live.co.uk,2019-09-23T18:54:17,reed,"Flat 36, Newton Court, Hatfield, Hertfordshire, AL10 9WX",Hertfordshire,"AL10 9WX","0777 244 0138",,"Recruitment Consultancy",Temporary,,,"Fellows Consultants Ltd",,s3://attachments.broadbean.com/346482279
346482153,"Amandeep Kharay",akharay22@gmail.com,2019-09-23T12:45:42,cvlibrary,,,,"0790 881 7313",,"Recruitment Consultancy",Temporary,,,,,s3://attachments.broadbean.com/346482153
346482151,"Hayley Whipps",hayley.whipps.97@gmail.com,2019-09-23T12:17:03,reed,,,,"0750 658 9675",,"Recruitment Consultancy",Temporary,,,"JD Wetherspoons","Team Leader",s3://attachments.broadbean.com/346482151
346482387,"Gemma Kao",gemkao.007@yahoo.com,2019-09-24T09:34:56,cvlibrary,,,,,,"Recruitment Consultancy",Temporary,,,"Charles Tyrwhitt",Artworker,s3://attachments.broadbean.com/346482387
346482643,"Alexandra Lane",alexxlane.108@hotmail.com,2019-09-25T13:32:34,cvlibrary,"8 Bridge Road South, Helen, Bay, BT19 1JT","County Down","BT19 1JT","0779 260 3960",,"Recruitment Consultancy",Temporary,,,"Elaine Biss",,s3://attachments.broadbean.com/346482643
346482667,"Nicola Ballini",nadstudio@hotmail.com,2019-09-25T16:46:43,gojobsite,"3 Stafford Cripps HouseGlobe Road, E20LN",London,E20LN,"0774 318 3099",,"Recruitment Consultancy",Temporary,,,,"INTERIOR DESIGNER",s3://attachments.broadbean.com/346482667
346483115,"Danielle West",danielleannwest@gmail.com,2019-10-01T13:44:18,gojobsite,"9 Elm House, Elm Road, Kingston Upon Thames, KT2 6JJ",London,"KT2 6JJ","0757 843 1986",,"Recruitment Consultancy",Temporary,,,"The Victoria Pub - Young's & Co Brewery","Sales and Marketing Coordinator",s3://attachments.broadbean.com/346483115
346483187,"Jack Sykes",jackhenrysykes@outlook.com,2019-10-01T12:08:02,gojobsite,,,,,,"Recruitment Consultancy",Temporary,,,JACK,"Till Supervisor, Co-Op",s3://attachments.broadbean.com/346483187
346483215,"Justin Chambers",justin_chambers@live.com,2019-10-01T13:23:20,gojobsite,,,,"0753 952 5697",,"Recruitment Consultancy",Temporary,,,"Solarplicity Energy","Data Management Analyst",s3://attachments.broadbean.com/346483215
346483201,"Darnell Asobie-Owoghiri",darnell_asobie@hotmail.co.uk,2019-10-01T13:08:38,gojobsite,"94, Wyndcliff road, Charlton, London, SE77LF",,SE77LF,"0740 017 1436",,"Recruitment Consultancy",Temporary,,,"Reckitt Benckiser","Packaging technician",s3://attachments.broadbean.com/346483201
346483231,"Charlotte Walker",charlottewalker@hotmail.co.nz,2019-10-01T14:22:39,reed,", London",Kent,,"44 771 774 5792",,"Recruitment Consultancy",Temporary,,,PHIL&TEDS,"GROW AND ACHIEVE",s3://attachments.broadbean.com/346483231
346483239,"Leo Sandiford",ladredesigns@gmail.com,2019-10-01T19:45:58,gojobsite,BRISTOL,,,,,"Recruitment Consultancy",Temporary,,,,,s3://attachments.broadbean.com/346483239
346483257,"Adekunle Ige",kunle.ig@gmail.com,2019-10-01T23:28:07,gojobsite,"32 Woolpack House, 2 Kettering Road, Enfield, EN3 6UU",London,"EN3 6UU","44 743 842 5144",,"Recruitment Consultancy",Temporary,,,"Whitesands School","Website / multimedia administrator",s3://attachments.broadbean.com/346483257
346483395,"Aleyna Mehmet",aleyna_1999@hotmail.co.uk,2019-10-03T21:29:43,reed,"Hello, Kent, DA7 4PE",Kent,"DA7 4PE","0792 669 7635",,"Recruitment Consultancy",Temporary,,,,,s3://attachments.broadbean.com/346483395
346483139,"Cuan Hansbury",cuan.hansbury@gmail.com,2019-09-30T18:39:13,reed,"14 Vaughan Avenue, Games, TN10 4EB",Kent,"TN10 4EB","0749 653 7425",,"Recruitment Consultancy",Temporary,,,CRS,"Freelance Designer",s3://attachments.broadbean.com/346483139
346483037,"Gail Pacifico",bpacifico@hotmail.com,2019-09-29T19:05:53,cvlibrary,pacifico,,,"44 780 337 2304","3711 0711","Recruitment Consultancy",Temporary,,,,"Logo designer",s3://attachments.broadbean.com/346483037
346483359,"Gcanup Gc",gclncguy@gmail.com,2019-10-03T11:48:36,gojobsite,"568 GreakWest Road, Hounslow, TW5 OTH",London,"TW5 OTH",,"737 535 9565","Recruitment Consultancy",Temporary,,,,"UI/UX Developer",s3://attachments.broadbean.com/346483359
346483409,"Waleed Bin Arshad",waleedshah10@gmail.com,2019-10-04T11:07:22,gojobsite,"701 London Road, Sutton North Cheam, Surrey, SM3 9DL",London,"SM3 9DL","0748 489 9264",,"Recruitment Consultancy",Temporary,,,EXPERINCE,"Linux Network Administrator",s3://attachments.broadbean.com/346483409
346483101,"Kamila Donald",kammy.donald@gmail.com,2019-09-30T13:39:53,cvlibrary,,,,"0775 712 4289",,"Recruitment Consultancy",Temporary,,,,,s3://attachments.broadbean.com/346483101
346482883,"Ilinca Manescu",ilinca.designs@gmail.com,2019-09-27T10:31:59,reed,,,,"0755 571 4671",,"Recruitment Consultancy",Temporary,,,,,s3://attachments.broadbean.com/346482883
346483557,"Renesa Nanda",renesa.nanda@gmail.com,2019-10-07T11:43:26,cvlibrary,"renesa., nanda",,,"44 743 816 0046",,"Recruitment Consultancy",Temporary,,,"E L INTERIOR DESIGNERS",,s3://attachments.broadbean.com/346483557
346483559,"Miruna Basaraba",mirunabasaraba@gmail.com,2019-10-07T12:02:43,cvlibrary,,,,,"074 6489","Recruitment Consultancy",Temporary,,,,,s3://attachments.broadbean.com/346483559
346483667,"Ben McGuire",benmcguire2000@gmail.com,2019-10-09T15:08:17,gojobsite,"The Patch, Lingfield Road, East Grinstead, RH19 2EE","West Sussex","RH19 2EE","0792 722 2544",,"Recruitment Consultancy",Temporary,,,"Tropical Sky","Visual editor",s3://attachments.broadbean.com/346483667
346483669,"Chattarika Chansawang",brightmoon1@sky.com,2019-10-09T15:26:47,reed,,,,,,"Recruitment Consultancy",Temporary,,,PERSONAL,,s3://attachments.broadbean.com/346483669