Id,Candidate,"E-Mail Address","Application date / time","Latest Source","Address Line 1",County,Postcode,"Mobile Number","Home Phone Number",Industry,"Contract / Job Type Required","Current Status","Available Date","Current Employer","Current Job Title","Attachment URL"
376238529,"Kirsty Taylor",Kirsty-jayne@hotmail.co.uk,2021-03-18T16:03:56,gojobsite,,,,"0753 207 8278",,IT,Contract,,,Greensill,"Business Change Transformation Manager",s3://attachments.broadbean.com/376238529
376219153,"Amine Haouas",moncelh@yahoo.co.uk,2021-03-18T13:33:30,gojobsite,,,,,"0777 124 5521",IT,Permanent,,,,,s3://attachments.broadbean.com/376219153
376238055,"Samuel Sicobo",sam.sic@hotmail.co.uk,2021-03-18T16:00:05,gojobsite,"41 Collingbourne Avenue, Bournemouth, Dorset, BH6 5QS",Dorset,"BH6 5QS","0783 274 1628",,Engineering,Permanent,,,"Magellan Aerospace Bournemouth","CNC Machinist",s3://attachments.broadbean.com/376238055
376236331,"Thomas Davies",tommydavies1@live.co.uk,2021-03-18T15:44:44,cvlibrary,"1 Kingsfield, Windsor, Berkshire, SL4 5RH",Berkshire,"SL4 5RH","0795 571 5871",,Marketing,Permanent,,,PhotoFarm,,s3://attachments.broadbean.com/376236331
325859605,"Aleksey Tikhomirov",dandi20045@hotmail.com,2021-03-17T18:13:04,cvlibrary,"Poole, Dorset",Dorset,BH149EH,"0745 013 0885",,Engineering,Contract,,,,"CNC Machine Setter/Operator",s3://attachments.broadbean.com/325859605
376121077,"Alomghir Hussain",alomghir20@gmail.com,2021-03-17T19:05:20,gojobsite,"10 Matthews House, Burgess Street, E14 7AT",London,"E14 7AT","0753 585 8855",,"Manufacturing and Production",Permanent,,,,,s3://attachments.broadbean.com/376121077
376117081,"Sarah Popoola",sarahpopoola1@outlook.com,2021-03-17T18:31:11,gojobsite,,,,"0784 993 8829",,Marketing,Permanent,,,"Clasado Biosciences","Marketing Assistant",s3://attachments.broadbean.com/376117081
376127321,"Jack Heidler",jackoheidler@hotmail.com,2021-03-17T20:11:15,gcs_recruitment_uk,Leeds,,,"0758 413 2023",,IT,Contract,,,"The Walt Disney Company","Social Media Supervisor",s3://attachments.broadbean.com/376127321
376122793,"Dilbag Singh",iamveeru@icloud.com,2021-03-17T19:22:53,gojobsite,", Amazon, E13 8RY",London,"E13 8RY","0744 877 1440",,"Manufacturing and Production",Permanent,,,"Premier recruitment","Warehouse Operative",s3://attachments.broadbean.com/376122793
376214341,"Alex Jobbings",alexjobbings@gmail.com,2021-03-18T12:59:16,gcs_recruitment_uk,,,,,,IT,Contract,,,"DIGITAL DESIGNER",,s3://attachments.broadbean.com/376214341
376214941,"Brandon Akintola",brandonsaelo@gmail.com,2021-03-18T13:03:40,gcs_recruitment_uk,"NOVEMBER 2020 - N OVEMBER 2020, Udemy, JANUARY",,,,"739 170 6350",Marketing,Permanent,,,,"Social Media Manager",s3://attachments.broadbean.com/376214941
376228661,"Vidhya Shankar",vvshankar78@gmail.com,2021-03-18T14:47:15,gcs_germany,"Venkatesan, Bangalore",,,"+91 90084 33199",,IT,Permanent,,,"Fractal Analytics Pvt Ltd","Senior Data Scientist",s3://attachments.broadbean.com/376228661
359101171,"Anish Chacko",anishchacko888@gmail.com,2021-03-17T18:53:15,gojobsite,"37 Deaconscroft, PE37, LL",,,"+44 7721 158218",,Engineering,Permanent,,,"L&T Limited","Junior Engineer",s3://attachments.broadbean.com/359101171
372817825,"Virat Ambatkar",viratambatkar@gmail.com,2021-03-18T04:21:30,gojobsite,"Currently, lives, B1","West Midlands",B1,"91 986 090 3506",,IT,Permanent,,,"Northern Trust","Team Lead",s3://attachments.broadbean.com/372817825
376131003,"Ryley Johnson",ryleyljohnson@gmail.com,2021-03-17T20:56:40,gojobsite,"London, JOHNSON, 07539",,07539,,,Marketing,Permanent,,,"D&A C*OMMUNICATIONS",,s3://attachments.broadbean.com/376131003
376140613,"Gavin McGrath",geemacone@aim.com,2021-03-17T22:57:43,gojobsite,"Flat E, 4 Meadow Close, London, E9 5NZ",London,"E9 5NZ","0749 300 5780",,"Manufacturing and Production",Permanent,,,,,s3://attachments.broadbean.com/376140613
282157469,"Dean Pagram",dean.pagram@sky.com,2021-03-17T21:25:02,gojobsite,"2 Surrey House, White Hart Lane, Romford, Essex, RM7 8JT",London,"RM7 8JT","0781 284 9760","0170 872 6267","Manufacturing and Production",Permanent,,,"Havering Museum","Front of House Volunteer",s3://attachments.broadbean.com/282157469
376201709,"Lewin Mboungo",mhlservice@ymail.com,2021-03-18T11:28:27,cvlibrary,"9 , High Street, London, SE20 7HJ",London,"SE20	7HJ","0775 269 8513",,"Manufacturing and Production",Permanent,,,,"Shipping	Coordinator",s3://attachments.broadbean.com/376201709
376258581,"Jafor Abu",jafor14_abu@yahoo.co.uk,2021-03-18T18:53:32,gojobsite,,,,,,IT,Contract,,,,"Junior / Mid Graphic Designer",s3://attachments.broadbean.com/376258581
376247223,"Oliver Saward",o.g.saward@gmail.com,2021-03-18T17:19:36,gojobsite,"17 Borough Park Road, Totnes, Devon, TQ9 5XW",Devon,"TQ9 5XW","0775 769 9296",,Engineering,Permanent,,,,,s3://attachments.broadbean.com/376247223
376266423,"Kieran Robinson",kieranr179@yahoo.co.uk,2021-03-18T20:15:39,cvlibrary,"Image, SO16 6DE",Hampshire,"SO16 6DE","0743 204 8100",,Engineering,Permanent,,,"Leonardo MW Ltd","Manufacturing Operative",s3://attachments.broadbean.com/376266423
322789223,"Venkata Mannepalli",venkataqa77@gmail.com,2021-03-18T19:45:15,jobserve_xml,In,,,"0741 561 8795",,IT,Contract,,,"Open Banking","Senior Software Developer",s3://attachments.broadbean.com/322789223
376245521,"Julius Griffiths",juliusgriffiths1@gmail.com,2021-03-18T17:04:39,gojobsite,"6b Kingdon Road, London, NW6 1PH",,"NW6 1PH","44 793 161 9396",,"Manufacturing and Production",Permanent,,,"Island Record","Press Assistant",s3://attachments.broadbean.com/376245521
376408447,Ramaseshi,ramaseshi.kolli@gmail.com,2021-03-20T07:56:12,gcs_recruitment_uk,,,,"91 990 260 6716",,IT,Permanent,,,"Ripencode Technologies Pvt Ltd","Technical Expert",s3://attachments.broadbean.com/376408447
376375627,"Ahsan Ali Lodhi",ahsanalilodhi@gmail.com,2021-03-19T19:05:11,cvlibrary,,,,,,IT,Permanent,,,"sewts GmbH","Software Engineer",s3://attachments.broadbean.com/376375627
374326249,"Wai Chuen Chan",ray2boy@gmail.com,2021-03-19T21:59:20,gcs_recruitment_uk,,,,"44 775 262 2934",,IT,Permanent,,,"FWD Life Insurance Company Limited","Senior System Engineer",s3://attachments.broadbean.com/374326249
376385555,"Karishma Nayyar",karishma.nayyar@gmail.com,2021-03-19T21:47:16,gcs_recruitment_ie,,,,"91 992 081 8320",,IT,Permanent,,,"WNS BPM GLOBEOP SERVICES","Program Analyst",s3://attachments.broadbean.com/376385555
327083545,"Matthew greenaway",mgreenaway38@hotmail.com,2021-03-19T18:35:42,cvlibrary,"Design Production Process Engineer - ACO Building Drainage, Barton-le-Clay",,,"0794 731 7355",,Engineering,Permanent,,,"ACO Building Drainage","Design Production Process Engineer",s3://attachments.broadbean.com/327083545
376373671,"Anthony Roach",anthonysroach@gmail.com,2021-03-19T18:36:20,gcs_recruitment_uk,", Maidenhead, Berkshire",,,"+44 7899 816835",,IT,Permanent,,,"Circdata Newbury","IT Manager",s3://attachments.broadbean.com/376373671
372332901,"Danny Dowsett",danddresources@googlemail.com,2021-03-19T18:35:34,gojobsite,"6 MAPLE LEAF, TIPTREE, Essex, CO5 0NJ",Essex,"CO5 0NJ","0785 002 5363","0162 181 0324",Engineering,Permanent,,,"ADP SPECIAL",,s3://attachments.broadbean.com/372332901
376417883,"Sadiya Javed",sadiyajaved961@gmail.com,2021-03-20T10:40:06,cvlibrary,,,,"44 758 791 4939",,"Manufacturing and Production",Permanent,,,,,s3://attachments.broadbean.com/376417883
376422171,"Matthew Cafer",mattcafer@hotmail.co.uk,2021-03-20T11:50:04,cvlibrary,"Matthew Cafer, E14 6DP",London,"E14 6DP","0789 996 2339",,"Recruitment Consultancy",Permanent,,,,,s3://attachments.broadbean.com/376422171
376419525,"Jibin George",georgejibin892@gmail.com,2021-03-20T11:08:18,gcs_recruitment_ie,"Apartment 2 , 20 Summerhill Road, Dun Laoghaire, Co. Dublin",,,"+353 89 240 3943",,IT,Permanent,,,"Safezone
Training and Consultancy Solutions","NETWORK ENGINEER",s3://attachments.broadbean.com/376419525
376398827,"Irina Burton",irina_burton@outlook.com,2021-03-20T03:38:20,gcs_engineering,"25 Bodiam Drive, Swindon, SN5 8BD",Wiltshire,"SN5 8BD",,"0738 737 5267",Engineering,Permanent,,,"Francis George Solicitor",Advocate,s3://attachments.broadbean.com/376398827
376434781,"Jennifer Clark",JenClark1986@outlook.com,2021-03-20T15:02:55,cvlibrary,"Harlow, Essex, CM187DE",Essex,CM187DE,"0795 433 9323",,"Manufacturing and Production",Permanent,,,,"Store Manager",s3://attachments.broadbean.com/376434781
376462181,"Calvin Crane",calvincrane@hotmail.com,2021-03-20T22:20:54,gojobsite,"2021 , Front End Full Stack Developer",,,,,Engineering,Contract,,,,,s3://attachments.broadbean.com/376462181
376301243,"Daniel Bentley",dannybentley15@gmail.com,2021-03-19T06:13:37,cvlibrary,,,,"0770 899 9462",,Engineering,Permanent,,,"Bentley Motor","strip fitter technician",s3://attachments.broadbean.com/376301243
376270517,"Vikram Shinde",vik.shinde@gmail.com,2021-03-18T21:08:26,gcs_recruitment_uk,"GOOGLE, CLOUD",,,"0742 429 4287",,IT,Contract,,,,"Cloud Solution Architect",s3://attachments.broadbean.com/376270517
376305549,"William Curtis",william-curtis32@outlook.com,2021-03-19T07:03:16,gojobsite,"Surrey, GU3 3BY",Surrey,"GU3 3BY",,,IT,Contract,,,"Tigerprint Limited","Production/Purchasing Manager",s3://attachments.broadbean.com/376305549
369755111,"Giorgos Antoniou",giorgosant@hotmail.com,2021-03-19T12:01:08,cvlibrary,"Doctoral Researcher, Lancaster",,,"0741 385 9095","0741 385 9095",Electronics,Permanent,,,"National Service - Cypriot Amry",Sergeant,s3://attachments.broadbean.com/369755111
376320479,"Beverly Tan",beverlythj@gmail.com,2021-03-19T09:57:11,gcs_recruitment_uk,"554A Bristol Rd, Birmingham, B29 6BD","West Midlands","B29 6BD","44(0) 747 479 8298",,Sales,Permanent,,,"DXCEL International Group","Planning intern",s3://attachments.broadbean.com/376320479
315141333,"IFY OTI",ify_oti@yahoo.com,2021-03-19T15:54:14,jobserve_xml,"25 Hilltop Close, Cheshunt, EN7 6QN",Hertfordshire,"EN7 6QN","0795 021 2216",,IT,Contract,,,"Deloitte LLP","IAM/PAM Specialist",s3://attachments.broadbean.com/315141333
376350679,"Duncan Nixon",duncannixon@me.com,2021-03-19T14:57:15,jobserve_xml,"Based:, Caerphilly",,,"0796 813 7191",,Engineering,Contract,,,"DEFRA / Environment Agency","Lead Developer",s3://attachments.broadbean.com/376350679
376352329,"Fde Abdul",rauf2001@hotmail.com,2021-03-19T15:06:24,jobserve_xml,"61 Park Road, Watford, WD17 4QJ",Hertfordshire,"WD17 4QJ","0786 222 2465",,IT,Contract,,,IAA,"Cloud Security Architect",s3://attachments.broadbean.com/376352329
376583525,"Paul Meeks",paulmeeks@gmail.com,2021-03-22T11:46:12,gojobsite,"IT Project Manager, Bicester, Oxfordshire",,,"0782 437 8537",,IT,Contract,,,"Whitaker Solutions Ltd","InfoSec Consultant/Project Manager",s3://attachments.broadbean.com/376583525
376553671,"Alan Hardwick",alanhardwick6@gmail.com,2021-03-22T14:07:11,cvlibrary,"14 Mullins Close, Basingstoke, RG21 5QU",Hampshire,"RG21 5QU","0783 399 3234",,Engineering,Permanent,,,"Linde Material Handing","Warehouse Operative",s3://attachments.broadbean.com/376553671
376622979,"Sohel Patel",sohel41985@gmail.com,2021-03-22T17:45:48,gojobsite,"58 Skelton Road, London, E7 9NJ",London,"E7 9NJ","44(0) 782 770 5277",,"Manufacturing and Production",Permanent,,,"Sainsbury Distribution Centre","Warehouse Operative",s3://attachments.broadbean.com/376622979
332477377,"Gideon Okunaiya",femigideon@yahoo.com,2021-03-22T18:47:41,gojobsite,"21 Abbey mead close, dartford, kent, da1 5uq",Kent,"da1 5uq","795 764 6414",,IT,Contract,,,"Trinity Claim","Power BI Specialist/SSRS Consultant",s3://attachments.broadbean.com/332477377
311946817,"Edward Puplampu",mr.pup@hotmail.com,2021-03-22T18:36:32,gojobsite,"image, 718",Surrey,718,"0787 188 8184",,IT,Contract,,,"Smart Safe Consulting","IT Auditor",s3://attachments.broadbean.com/311946817
309601599,"JAGAN JAYAKARTHIKEYAN",jaganmalli@gmail.com,2021-03-22T18:12:06,jobserve_xml,"49 Summer Drive",London,"UB7 9GD","0742 402 5910",,IT,Contract,,,"Cognizant Microsoft Business Group","Azure Data Architect",s3://attachments.broadbean.com/309601599
376631153,"Vinoth Veluswamy",Vincnr.vino@gmail.com,2021-03-22T19:08:06,gojobsite,"About, Watford, me, WD17 2AJ",Hertfordshire,"WD17 2AJ","44 745 935 5322",,IT,Permanent,,,Real,"Software & Asset manager",s3://attachments.broadbean.com/376631153
376634677,"Mathews Chanda",mathewschanda1@gmail.com,2021-03-22T19:47:22,gojobsite,"13293 Chikola Street",,,,"966 303 682",Engineering,Permanent,,,"First Quantum Minerals Plc","Mechanical Technician",s3://attachments.broadbean.com/376634677
362269539,"Branimir Viljevac",bran.viljevac@gmail.com,2021-03-22T20:30:19,gcs_recruitment_ie,"Dublin, Dublin 6",,"Dublin 6","083 198 0713",,IT,Permanent,,,"Distilled SCH",,s3://attachments.broadbean.com/362269539
376640837,"Brandon Rye",brandon12rye@gmail.com,2021-03-22T21:10:12,cvlibrary,"[, Image",,,"0780 674 6654",,Engineering,Permanent,,,,"Trainee Shop Fitter",s3://attachments.broadbean.com/376640837
376631329,"Federico Sobbia",sobbiaf@gmail.com,2021-03-22T19:10:12,gojobsite,", NGM, Nottingham",,,"+44 7783 135150",,IT,Contract,,,"YBS - Yorkshire Building Society Group","UK IT CMO Project & Finance Analyst",s3://attachments.broadbean.com/376631329
376639653,"Gareth Davies",gazdavies@protonmail.ch,2021-03-22T20:54:11,jobserve_xml,"(, Swiss",,,,"44 161 818 2345",IT,Contract,,,,,s3://attachments.broadbean.com/376639653
376686091,"Osman Ali",messageosman@gmail.com,2021-03-23T09:42:17,jobserve_xml,,,,,,IT,Contract,,,,Developer,s3://attachments.broadbean.com/376686091
14691175,"Rui Martins",ruijorgemartins@yahoo.co.uk,2021-03-23T09:57:12,jobserve_xml,"[, Image",Wisconsin,2810,"+351 915 485 370","35 192 411 3109",Consultancy,Permanent,,,Twistag,"Software developer",s3://attachments.broadbean.com/14691175
376644481,"Alexandra Papadopoulos",a97papadopoulos@hotmail.com,2021-03-22T22:12:17,cvlibrary,"Image, EN4 8QT",London,"EN4 8QT","0749 618 9093",,Marketing,Permanent,,,"Ashley Page","Insurance Broker - Claims Administrator",s3://attachments.broadbean.com/376644481
376683635,"Navjot Gill",navjotg@gmail.com,2021-03-23T09:15:18,jobserve_xml,"Edge Of The Green, Green Road, Thorpe, Surrey, TW20 8QW",Surrey,"TW20 8QW","44(0) 795 819 3583",,IT,Contract,,,UBS,"Senior EUC Engineer",s3://attachments.broadbean.com/376683635
376690831,"Prem Moti",prem.moti@gmail.com,2021-03-23T10:24:15,jobserve_xml,,,,"0797 680 7978",,IT,Contract,,,"Conigital Limited","Solutions Architect/Infrastructure Specialist",s3://attachments.broadbean.com/376690831
329794849,"Justin Bailey",justinbailey_33@hotmail.co.uk,2021-03-17T07:58:54,gojobsite,"277B Singlewell Road, Gravesend, DA11 7RN",Kent,"DA11 7RN","0787 320 8768","0147 439 4640",Electronics,Permanent,,,"UCC Coffee","Key Account Administrator",s3://attachments.broadbean.com/329794849
376036623,"Mamta Juneja",mamtajunejadev@gmail.com,2021-03-17T08:45:09,jobserve_xml,"[, Image",,,"44 743 849 3950",,IT,Permanent,,,"Tata Consultancy Services","Assistant Consultant",s3://attachments.broadbean.com/376036623
362075509,"Daniel Ferreira Dos Reis",afmdaniel@hotmail.com,2021-03-18T07:32:38,gojobsite,", Unite Kingdom, Rickmansworth, WD3 7HB",Hertfordshire,"WD3 7HB","440 749 188 0260",,IT,Permanent,,,"Victory Currier Ltd","C# Developer",s3://attachments.broadbean.com/362075509
376176217,Charles,charlesr09@hotmail.com,2021-03-18T07:57:12,gcs_recruitment_uk,,,,"44 783 672 2434",,IT,Contract,,,"Charles Wagner, MBA",,s3://attachments.broadbean.com/376176217
372809541,"Abul Hassan",a.hassan94@hotmail.com,2021-03-17T15:44:20,gcs_recruitment_uk,"2 Mottistone Lane",,,,,IT,Permanent,,,,"IT Service Desk Analyst",s3://attachments.broadbean.com/372809541
369942561,"Benjamin Jack Nelson",Jacknelson24@hotmail.com,2021-03-17T14:57:16,gcs_recruitment_uk,", Guisborough, TS148BS","North Yorkshire",TS148BS,"0745 087 3332",,IT,Permanent,,,"Saltburn Golf Club",Cleaner,s3://attachments.broadbean.com/369942561
376108859,"George Sin",george.sin@gmail.com,2021-03-17T17:18:33,gojobsite,"2 Buckley Close, Forest Hill",,,"0208 693 4293",,IT,Permanent,,,"Avios Group Limited","Lead / Senior Android Developer",s3://attachments.broadbean.com/376108859
376074325,"Kieran Shalloo",contact@kieranshalloodesign.com,2021-03-17T13:06:07,gojobsite,"44qwbm8f9bg]User Experience Designer",,,"0771 562 8199",,IT,Contract,,,,,s3://attachments.broadbean.com/376074325
376078771,"Gaurav Gupta",prog8plan@gmail.com,2021-03-17T13:33:23,jobserve_xml,,,,,,IT,Contract,,,,"Planning and Reporting Analyst",s3://attachments.broadbean.com/376078771
370483693,"Andrea Bonzi",andrea.bonzi.24@gmail.com,2021-03-17T11:41:27,cvlibrary,"1, Essex",Essex,SS17,"+44 7459 476848",,IT,Permanent,,,"I Heart Studios","IT Lead",s3://attachments.broadbean.com/370483693
376065101,"Tilak Pawar",tilak.pawar21@gmail.com,2021-03-17T12:04:47,gojobsite,"Flat 16 Porchester Court 18 Porchester Gardens, London, W2 4DF",London,"W2 4DF","44(0) 744 038 7193",,IT,Permanent,,,,,s3://attachments.broadbean.com/376065101
352980953,"Onur Zulhayir",okz69jobs@hotmail.com,2021-03-17T14:46:09,cvlibrary,"[, Image",,,"0741 522 2025",,Electronics,Permanent,,,,,s3://attachments.broadbean.com/352980953
376090979,"Bilel Drira",Bilel.dr@gmail.com,2021-03-17T15:00:31,gojobsite,,,,,,IT,Permanent,,,"Telnet Holding","Project Manager",s3://attachments.broadbean.com/376090979
279956533,"Andrew Tekle-Cadman",futurevisibleltd@gmail.com,2021-03-22T10:18:14,jobserve_xml,"36 Bowness Crescent, Kingston Vale, London, SW15 3QL",London,"SW15 3QL","44(0) 797 367 6327",,IT,Contract,,,"Financial Times","Quality Engineer",s3://attachments.broadbean.com/279956533
376574725,"KEVIN BABATUNDE",kevbabs@hotmail.com,2021-03-22T10:45:35,jobserve_xml,,,,"0795 689 5282",,IT,Contract,,,DXC,"Cyber Security Analyst",s3://attachments.broadbean.com/376574725
376574713,"Sushmith Satheesan",sushmith.satheesan@outlook.com,2021-03-22T10:45:29,gcs_recruitment_uk,"47 Groveleaze, Shirehampton, BS11 9QR",Bristol,"BS11 9QR",,"0751 545 2574",IT,Contract,,,DEFRA,"Escalation Performance Analyst (Contractor)",s3://attachments.broadbean.com/376574713
376650089,"Gagan Dua",dua_gagan@yahoo.com,2021-03-22T23:36:16,gcs_recruitment_uk,,,,"+44 7585 944103",,IT,Contract,,,"BNP Paribas","Sr. Business consultant",s3://attachments.broadbean.com/376650089
376588797,"Shoushan Eretzian",shoushane@hotmail.com,2021-03-22T12:27:39,gojobsite,"37 De Lara Way, Woking, Surrey, GU21 6NY",Surrey,"GU21 6NY","0788 777 7049",,Accountancy,Permanent,,,,,s3://attachments.broadbean.com/376588797
359929131,"Jeegar Pandya",jeegar@hotmail.co.uk,2021-03-22T14:57:12,jobserve_xml,,,,"00 44 7 462 347 447",,Accountancy,Permanent,,,,,s3://attachments.broadbean.com/359929131
376694045,"John Bottoms",john.bottoms@circlesq2.co.uk,2021-03-23T10:52:46,gojobsite,"177 Bolton Road, Edgworth, Lancashire, BL7 0AF","Greater Manchester","BL7 0AF","0771 276 9108",,,,,,"Speedy Hire PLC","Project Manager",s3://attachments.broadbean.com/376694045
376703591,"Sri Jyothi",Srijyothi171@gmail.com,2021-03-23T12:09:15,jobserve_xml,"AWS DevOps Engineer [, image",,,"0744 869 9453",,IT,Contract,,,,,s3://attachments.broadbean.com/376703591
376703601,"LAWRENCE ADEOYE",lawren_dejil@yahoo.com,2021-03-23T12:09:17,jobserve_xml,"5 Eynswood Drive, Sidcup, DA14 6JQ",Kent,"DA14 6JQ","0783 882 4296",,IT,Contract,,,"CFC Underwriting","3rd Line Infrastructure Engineer",s3://attachments.broadbean.com/376703601
352094907,"Ciaran Hackett",ciaranhackett93@gmail.com,2021-03-15T14:59:15,gcs_recruitment_ie,", County, Leixlip",,,"087 126 6781",,IT,Permanent,,,"CPL Integrated Services","Level 2 Coach",s3://attachments.broadbean.com/352094907
375756537,"Sean Duguid",s.n.c.duguid@gmail.com,2021-03-15T12:22:50,gojobsite,"8 Drayton Close, Bracknell, Berkshire, RG12 9AY",Berkshire,"RG12 9AY","0789 613 9737","0134 440 9121",IT,Permanent,,,FUJITSU,"Customer Support Analyst",s3://attachments.broadbean.com/375756537
280785801,"Chandana Kayarat",chandanakayarat@gmail.com,2021-03-15T13:19:11,cvlibrary,"[, Image, London",Essex,IG13BA,"0758 674 2385","0044 7069",IT,Permanent,,,"Computer Science Corporation","Application Designer",s3://attachments.broadbean.com/280785801
353360135,"N Clair",n.clair68@yahoo.co.uk,2021-03-15T17:02:17,gojobsite,Bedford,,,"0752 796 3877",,Engineering,Permanent,,,"Reuse Centre",,s3://attachments.broadbean.com/353360135
367486015,"Hem Chandar Sundar",shyamralph@gmail.com,2021-03-15T16:26:42,monsterxml,"2, Rafter's court, Dublin",,,"+353 89 981 2815",,IT,Permanent,,,"APPLICATION SECURITY",Bachelors,s3://attachments.broadbean.com/367486015
375795035,"Ian Taylor",ian.taylor@taylormailbox.plus.com,2021-03-15T16:34:23,gojobsite,,,,,,IT,Contract,,,"DANSKE BANK","Head of Equities Technology",s3://attachments.broadbean.com/375795035
370552035,,archana.shetty711@gmail.com,2021-03-15T16:00:09,jobserve_xml,,,,,,IT,Permanent,,,,"GoBack]QA Engineer",s3://attachments.broadbean.com/370552035
314607717,"WALE ARINOLA",wale.arinola@gmail.com,2021-03-12T09:30:20,jobserve_xml,,,,"0740 565 6835",,IT,Contract,,,"Parexel Intl","Insights					MI Analyst/Power BI Developer",s3://attachments.broadbean.com/314607717
371376923,"Graham Pell",grahampell64@sky.com,2021-03-12T09:33:44,reed,"_GoBack], Peterborough, Cambridgeshire, PE2 8UN",Cambridgeshire,"PE2 8UN","44(0) 773 045 4003",,"Logistics Distribution and Supply Chain",Permanent,,,"Roquette UK","Engineering Storeman",s3://attachments.broadbean.com/371376923
345042507,"SURESH KARUTURI",msbisathya@gmail.com,2021-03-12T09:27:18,jobserve_xml,,,,,"044 742 436 8737",IT,Contract,,,Period,"Power BI Consultant/Data Insights Analyst",s3://attachments.broadbean.com/345042507
375448931,Ashok,durganti.td@gmail.com,2021-03-12T09:39:14,gcs_recruitment_uk,,,,"91 982 020 4112",,IT,Contract,,,,"Technical Lead",s3://attachments.broadbean.com/375448931
375434801,"Vijay Harish Sundar",vijayharishsundar@hotmail.com,2021-03-12T06:55:23,gcs_recruitment_uk,,,,"0755 786 5193",,IT,Permanent,,,ALTRAN,"Senior Software Engineer",s3://attachments.broadbean.com/375434801
375482277,"Charu Kaushik Tiwari",charu.kaushik1990@gmail.com,2021-03-12T14:27:13,gcs_recruitment_uk,,,,"0759 143 8685",,IT,Permanent,,,"Johnson & Johnson",,s3://attachments.broadbean.com/375482277
375497119,"David Lindop",dave.lindop@yahoo.co.uk,2021-03-12T16:33:07,gojobsite,"7, Taylors Mews, Neath, MK14 6HL",Buckinghamshire,"MK14 6HL","0775 933 8002","0190 866 1874",Engineering,Permanent,,,"Radcliffe Rehabilitation","Mechanical Engineer",s3://attachments.broadbean.com/375497119
375492747,"Tinu Junaid",atinukejunaid@yahoo.co.uk,2021-03-12T15:56:45,gojobsite,,,,"0775 488 3512",,IT,Contract,,,Accenture,"PMO Project Support Analyst",s3://attachments.broadbean.com/375492747
327600289,"Kostas Kostantinou",kkostantinou83@gmail.com,2021-03-12T15:59:23,gojobsite,"11D Baden House, MEng, CF23 5DG",Caerdydd,"CF23 5DG","44(0) 795 053 9037",,Engineering,Permanent,,,"KOSTAS KOSTANTINOU","MECHANICAL ENGINEER",s3://attachments.broadbean.com/327600289
339184493,"Shashank Jha",shashank.jha@gmail.com,2021-03-12T16:32:31,gojobsite,"IT, London",,,"44 772 150 5450",,IT,Permanent,,,"Codaemon eCommerce Softwares","Software Delivery Project Manager",s3://attachments.broadbean.com/339184493
321442831,"Uzair Sofiyan Mohammed",uzair_sofiyan@yahoo.com,2021-03-12T16:18:30,gojobsite,,,,,,IT,Contract,,,Period,,s3://attachments.broadbean.com/321442831
373975845,"FASHANU FADEKE",fashanufadeke@gmail.com,2021-03-12T14:03:19,jobserve_xml,00234,,00234,,,IT,Permanent,,,"START DATE - END DATE",RESPONSIBILITIES,s3://attachments.broadbean.com/373975845
355368407,"Temi Oyewoga",toyewoga1@gmail.com,2021-03-12T16:35:23,gojobsite,"6789a756, temi, London, 07739",,07739,,,IT,Permanent,,,,"IT PROJECT MANAGER - NETWORK HOMES",s3://attachments.broadbean.com/355368407
370492659,"Rajashekar Reddy",qa.iversion@gmail.com,2021-03-12T19:42:06,jobserve_xml,"Location:, Slough, Berkshire",,,"0740 524 4525",,IT,Permanent,,,Essentra,"Agile  QA Engineer",s3://attachments.broadbean.com/370492659