Id,Candidate,"E-Mail Address","Application date / time","Latest Source","Address Line 1",County,Postcode,"Mobile Number","Home Phone Number",Industry,"Contract / Job Type Required","Current Status","Available Date","Current Employer","Current Job Title","Attachment URL"
299651539,"Stephen Mita",stemita@yahoo.co.uk,2019-08-22T13:53:53,cvlibrary,"9 Irvan Avenue, West Bromwich, B70 0BH","West Midlands","B70 0BH","0790 475 6193",,"Community Services",Contract,,,"Royal Mail Warehouse Operative & Sorter","shop assistant",s3://attachments.broadbean.com/299651539
298481413,"Gary Dutton",garydutton85@icloud.com,2019-08-22T18:52:35,cvlibrary,"Image, IP16 4UY",Suffolk,"IP16 4UY","0739 727 0310",,Engineering,Contract,,,"Hayes Storage logistics","Data Operative",s3://attachments.broadbean.com/298481413
299695351,"Sarah Greaves",sarah.greaves@live.co.uk,2019-08-22T19:54:22,cvlibrary,"17, Highley Hall Croft, Clifton, HD6 4LL","West Yorkshire","HD6 4LL","0749 599 4357",,"Not for Profit and Charities",Permanent,,,"Credit Resource Solutions","Marketing Manager",s3://attachments.broadbean.com/299695351
299670761,"Tanith Graham",tanithgraham@gmail.com,2019-08-22T16:11:11,eden_brown_charities,"43 HEALY PLACE, STOKE, PL2 1BA",Devon,"PL2 1BA","0750 774 8061",,"Not for Profit and Charities",Temporary,,,"H&M          Plymouth","Buying Assistant",s3://attachments.broadbean.com/299670761
299954405,"adel Mouloudi",adidel2001@yahoo.com,2019-08-25T15:42:31,cvlibrary,London,,,"0778 978 4365",,"Property and Housing",Contract,,,"EXCELLENCE TAILLORING",EDUCATION,s3://attachments.broadbean.com/299954405
296940695,"Uthaminathan S",uthaminathans@gmail.com,2019-08-25T04:01:46,gojobsite,Madiwala,,,"91 950 099 3696",,Engineering,Permanent,,,,"HVAC Project Engineer",s3://attachments.broadbean.com/296940695
300000501,"Mahendran Srinivasan",mahran8690@gmail.com,2019-08-26T04:54:33,gojobsite,,,,"+91 99946 32578",,Engineering,Permanent,,,"RECENT EMPLOYER",,s3://attachments.broadbean.com/300000501
300008419,"Jahmella Robinson",jahmellarob@hotmail.co.uk,2019-08-26T06:25:38,cvlibrary,"07535 811 633",,,,,"Public Sector and Government",Contract,,,"Jahmella Encourages Ltd",Director,s3://attachments.broadbean.com/300008419
299777033,"Roy Macpepple-Jaja",r.mac@nhpdc.com,2019-08-23T11:54:28,cvlibrary,"Non-Executive Board Member VC , * 58 Coniston Road, Bromley, Kent, BR1 4JQ",Kent,"BR1 4JQ","0777 287 1343",,,,,,"Tower Hamlets Council","Interim Strategic Manager",s3://attachments.broadbean.com/299777033
299787689,"ross orr",rossorr2703@gmail.com,2019-08-23T13:29:48,reed,,,,"0749 838 2943",,,,,,,caretaker,s3://attachments.broadbean.com/299787689
299772697,"Adam Gaskell",adamgaskell@yahoo.com,2019-08-23T11:21:34,cvlibrary,"71 Chapel Lane, Farnborough",,,,,,,,,,,s3://attachments.broadbean.com/299772697
299776761,"John Walsh",jw@oshine.ie,2019-08-23T11:51:48,cvlibrary,,,,"(0) 753 158 1845",,,,,,"Oisin Developments Ltd",,s3://attachments.broadbean.com/299776761
299823873,"Billy Linington",Billy_linington@hotmail.com,2019-08-23T20:04:40,gojobsite,", London",,,"44(0) 775 603 6148",,"Building and Construction",Permanent,,,,"MEP Manager",s3://attachments.broadbean.com/299823873
299926119,"Andrew Lowe",andylowe616@gmail.com,2019-08-25T09:05:12,eden_brown_built_environment,"59 Ruskin Avenue, Welling, Kent, DA16 3QQ",Kent,"DA16 3QQ","0772 076 2698",,Engineering,Permanent,,,"Lidl UK","Assistant Maintenance Manager",s3://attachments.broadbean.com/299926119
299960553,"Nigel Voden",nigel.voden@me.com,2019-08-25T17:10:21,reed,", Harrow, London",,,"0794 145 6415",,"Not for Profit and Charities",Permanent,,,Capita,"Customer Service Officer",s3://attachments.broadbean.com/299960553
300048823,"Blair Buchanan",blair.buchanan@yahoo.com,2019-08-26T12:50:14,gojobsite,"59 Huddersfield Rd, Skelmanthorpe",,,,,"Building and Construction",Contract,,,"Eatts Building",Carpenter,s3://attachments.broadbean.com/300048823
300037879,"Kenneth Keen",ken@echofoundation.co.za,2019-08-26T11:07:39,reed,,,,"002 783 442 7066","002 741 581 8042","Not for Profit and Charities",Permanent,,,"Kenneth H Keen",,s3://attachments.broadbean.com/300037879
300022011,"Adeolu Gidado",Adeolugidado@yahoo.com,2019-08-26T08:43:28,gojobsite,,,,"+44 7459 414896",,"Building and Construction",Permanent,,,"BMRP Limited","Inventory Manager",s3://attachments.broadbean.com/300022011
300046499,"Matthew Priest",mattpriest2@googlemail.com,2019-08-26T12:26:39,gojobsite,"9 Taylor Stree t, Lower Walton, co., WA46HD",Cheshire,WA46HD,"0797 439 3934","0758 363 0538","Building and Construction",Contract,,,"Smart  Meter  Engine er",,s3://attachments.broadbean.com/300046499
299890601,"Pedro De Almeida",almeida1410@hotmail.com,2019-08-24T17:38:00,gojobsite,,,,,,"Building and Construction",Permanent,,,"PEDRO DEALMEIDA",,s3://attachments.broadbean.com/299890601
300026617,"Joel Felix",Joelfelix@live.com,2019-08-26T09:27:34,gojobsite,"Bedford, MK410NT",Bedfordshire,MK410NT,"0797 136 4902",,Engineering,Contract,,,Engie/interservice,,s3://attachments.broadbean.com/300026617
300071631,"Azadur Rahman",azadrahman@hotmail.co.uk,2019-08-26T16:25:42,cvlibrary,"11 West Gardens, London, E1W 3QU",London,"E1W 3QU","0794 979 4939",,"Property and Housing",Contract,,,"Supreme Wholesales Ltd","Delivery Driver - Warehouse Assistant",s3://attachments.broadbean.com/300071631
300073625,"Ankitha Ankitha",gugulothankitha@gmail.com,2019-08-26T16:45:47,gojobsite,"Email :gugulothankitha@gmail., NAIK",,,"990 894 0891",,"Design and Creative",Permanent,,,,,s3://attachments.broadbean.com/300073625
302990927,"Duncan Clifford",duncanclifford09@gmail.com,2019-09-16T13:11:32,reed,"118 Rothesay Gardens, Plymouth, PL5 3TB",Cornwall,"PL5 3TB","0789 620 6343",,,,,,"DC Decorators",,s3://attachments.broadbean.com/302990927
302999881,"Craig Bristow",craigbristow@me.com,2019-09-16T13:59:24,charityjob,"Rectory Mews, Westgate, Louth, LN11 9YE",Lincolnshire,"LN11 9YE","0741 540 5551",,"Not for Profit and Charities",Permanent,,,YMCA,,s3://attachments.broadbean.com/302999881
302983027,"Suzana Pirc",pirc.suzana@gmail.com,2019-09-16T12:30:41,gojobsite,"47 Windsor road, Liverpool, L13 8BA",Merseyside,"L13 8BA","0746 977 4680",,Sales,Permanent,,,"Prince Alfred Residential Care Home          Rose Villas","Care Assistant",s3://attachments.broadbean.com/302983027
303288393,"Vasilica Iurie",vasilicaiurie@gmail.com,2019-09-18T06:27:19,reed,,,,"+44 7733 916326",,Engineering,Permanent,,,,,s3://attachments.broadbean.com/303288393
303280701,"Sayuj Keerangatil",sayujlibra1996@gmail.com,2019-09-18T05:59:16,gojobsite,,,,,+9175061461078850282521,"Recruitment Consultancy",Permanent,,,,"Recruitment Specialist",s3://attachments.broadbean.com/303280701
303309747,"Mariya Bheekhun",mhbheekhun@gmail.com,2019-09-18T08:53:32,gojobsite,"London, N12BH",London,N12BH,"0771 565 7972",,Engineering,Contract,,,"Temple Group","Land Access Coordinator",s3://attachments.broadbean.com/303309747
303307077,"Titilayo  M Matuluko",tilanda2001@yahoo.co.uk,2019-09-18T08:40:05,reed,"1254 Albemarle Road Beckenham BR3 5HR",,,"0208 658 2511",,,,,,,"Group Accountant",s3://attachments.broadbean.com/303307077
303299097,"Donka Dimitrova",gazelle5500@gmail.com,2019-09-18T07:45:04,gojobsite,"Flat 3 Hill Crest Court, Brownhill Road, London, SE6",,,,,Engineering,Contract,,,"The Savoy Hotel Ltd","GUEST EXPERIENCE AND COMMUNICATIONS SPECIALIST",s3://attachments.broadbean.com/303299097
303299357,"Tanya Damanti",damanti.tanya@gmail.com,2019-09-18T07:46:38,cvlibrary,"30 Stubley Drive, Dronfield Woodhouse, Derbyshire",,,"0757 906 6576",,"Building and Construction",Contract,,,"Estee Lauder Companies Corporate Headquarters","Global Packaging Operations Artwork Manager",s3://attachments.broadbean.com/303299357
303179729,"Rebecca Adlington",Rebeccajayneadlington@outlook.com,2019-09-17T13:16:48,cvlibrary,"G7 The Vestry, Zion Chapel, George Street, Wakefield, WF1 1LG","West Yorkshire","WF1 1LG","0771 056 1239",,,,,,"GoBack]Newly Wed Foods","Administrator/Coordinator/Payroll Administrator/ HR Assistant",s3://attachments.broadbean.com/303179729
303231363,"Deborah Griffiths",deb.9770@yahoo.com,2019-09-17T18:43:11,eden_brown_built_environment,"84 Burnmoor Road, Bolton, BL2 5LU","Greater Manchester","BL2 5LU","0797 686 8613",,"Admin and Secretarial",Permanent,,,"Bristol Street Motors","Fleet Administrator",s3://attachments.broadbean.com/303231363
303218133,"Joshua Jakobek",joshuajakobek@outlook.com,2019-09-17T17:03:21,gojobsite,,,,"0798 567 3178",,,,,,"Ballymore Asset Management Limited",,s3://attachments.broadbean.com/303218133
303221665,"Martyn Dunkley",martynboots@gmail.com,2019-09-17T17:28:51,cvlibrary,Birmingham,,,"0749 645 0202",,,,,,"McDermotts Ltd","Site Supervisor",s3://attachments.broadbean.com/303221665
303219123,"stephen banwell",steve.banwell@sky.com,2019-09-17T17:09:37,gojobsite,"8 Langley Walk Langley Green, Crawley, West Sussex, RH11 8LR","West Sussex","RH11 8LR","0796 732 2763","0129 397 3362",,,,,"Jet  Maintenance Ltd","Plumber and Drainage engineer",s3://attachments.broadbean.com/303219123
303224271,"Dan Dejan Kocev",career@berkshireim.co.uk,2019-09-17T17:47:12,eden_brown_built_environment,"| Project Manager , Location:, Slough, SL1",Berkshire,SL1,"+44 7901 924116",,"Building and Construction",Contract,,,"Pixel Global AV","Project/Contracts Manager",s3://attachments.broadbean.com/303224271
303196405,"Otilia Neagu",alexandraotilia@yahoo.com,2019-09-17T14:42:02,cvlibrary,"Image, RG24 8UF",Hampshire,"RG24 8UF","0745 906 9537",,,,,,"C P Law Associates",Solicitor,s3://attachments.broadbean.com/303196405
303191911,"Sandra Francis",sandrafrancis839@btinternet.com,2019-09-17T14:17:15,cvlibrary,,,,"0795 734 7642",,,,,,"Duncan Lewis",Solicitor,s3://attachments.broadbean.com/303191911
303191861,"Ben Hobden",ben.hobden60@gmail.com,2019-09-17T14:16:59,gojobsite,"9, Stanmer Village, Stanmer Park, Brighton, BN1 9PZ","East Sussex","BN1 9PZ","0749 306 9871",,Engineering,Permanent,,,"Hassocks and Hurst Autocentre","Owner, Director and Mechanic",s3://attachments.broadbean.com/303191861
303191751,"Amrinder Aulakh",amrinderaulakh92@gmail.com,2019-09-17T14:16:35,cvlibrary,"7 Swanage Waye, Hayes, Middlesex, UB4 0NX, UK",,,"44 753 453 1725",,,,,,"Pinder Reaux & Associates","Trainee Solicitor",s3://attachments.broadbean.com/303191751
303191633,"Carman IAN Ramsay",ianram4@netscape.net,2019-09-17T14:16:33,reed,"47 Nelgarde Road, London, SE6 4TB",London,"SE6 4TB","0743 834 9727",,,,,,"Premier Research Group Limited","Treasury Analyst",s3://attachments.broadbean.com/303191633
303217765,"Erica Berki",Erica.R.Berki@gmail.com,2019-09-17T17:01:05,cvlibrary,"52 Milton Park, London, N6 5QA",London,"N6 5QA","0773 840 7977",,,,,,"New South Wales Crown Solicitor's Office  
Community Law Practice Group","Senior Solicitor",s3://attachments.broadbean.com/303217765
303201133,"Caroline Powell",carolinepowell100@gmail.com,2019-09-17T15:10:27,reed,"6 Viaduct Close, Bassaleg, NP10 8FT",Caerffili,"NP10 8FT","0774 753 5489",,"Building and Construction",Permanent,,,"Target Group","Client Account Director",s3://attachments.broadbean.com/303201133
303235725,"Wayne Richard Parry",wrplondon@hotmail.co.uk,2019-09-17T19:19:17,eden_brown_built_environment,Gravesend,,,"0796 952 4897",,Engineering,Permanent,,,"Rydon Maintenance Limited","Mobile Building Service Engineer",s3://attachments.broadbean.com/303235725
300406205,"Atifa Ali-Khan",atifaak@hotmail.co.uk,2019-09-17T14:36:02,cvlibrary,"8 Angus Drive, Ruislip, HA4 0SB",London,"HA4 0SB",,"0208 841 0730",,,,,"Healthwatch Hounslow","Chief Officer & Company Secretary",s3://attachments.broadbean.com/300406205
303214785,"Philip Wriglesworth",philipjw123@hotmail.com,2019-09-17T16:41:07,gojobsite,"Ground Floor Flat, 178 Revelstoke Road, London, SW18 5PA",London,"SW18 5PA","0773 114 2512",,,,,,,,s3://attachments.broadbean.com/303214785
303247437,"Maria Medina",mariavmedina01@gmail.com,2019-09-17T21:05:36,gojobsite,"201; , Punta Cana Village, Punta Cana, Calle Palma Cana",,,,"849 883 0193","Design and Creative",Permanent,,,,,s3://attachments.broadbean.com/303247437
303337951,"Ikenna Darius Opara",oparafam@googlemail.com,2019-09-18T11:31:35,gojobsite,"5 Everett Close, Cheshunt, EN7 6XD",Hertfordshire,"EN7 6XD","0784 208 6659",,,,,,,"HSE prosecuting advisor",s3://attachments.broadbean.com/303337951
302272811,"Eduard Vartolomei",eduard.v@mail.com,2019-09-11T06:18:39,cvlibrary,", London",,,"0776 536 5247",,Engineering,Permanent,,,"Maybrick Property Maintenance","MECHANICAL CONTRACTOR",s3://attachments.broadbean.com/302272811
302313817,"Alex Hogg",alex.s.hogg@gmail.com,2019-09-11T10:35:28,gojobsite,"A, Crowthorne, RG45 7FG",Berkshire,"RG45 7FG","0783 424 1244",,Engineering,Permanent,,,"DES Group Limited","Electrical Contractor",s3://attachments.broadbean.com/302313817
301859665,"Brian Martin",blmartin123@outlook.com,2019-09-08T18:42:13,eden_brown_built_environment,"12 New Road, Norton Sub Hamdon, Somerset, TA14 6SB",Somerset,"TA14 6SB","0750 830 5891",,"Building and Construction",Permanent,,,"Luxury Apartments Renovation","Project Manager",s3://attachments.broadbean.com/301859665
301723841,"Anthony Lucas",tony69lucas@gmail.com,2019-09-07T06:44:09,cvlibrary,"3 Crawley Road, Alvaston, De249ga",Derbyshire,De249ga,"0770 385 5770",,"Property and Housing",Permanent,,,,"Maintenance technician",s3://attachments.broadbean.com/301723841
301724423,"Tim Meyer",marielovedayslater@gmail.com,2019-09-07T06:52:55,cvlibrary,"Image, PL267UG",Cornwall,PL267UG,,"0172 682 1434","Building and Construction",Permanent,,,"Coombe Carpentry",Joiner:,s3://attachments.broadbean.com/301724423
260889687,"mark Jones",markspark.jones@gmail.com,2019-09-09T13:03:15,gojobsite,"The Cunliffe Arms, Jeffrey's Road, Wrexham, Clwyd",Wrecsam,,"0759 988 8622",,"Building and Construction",Contract,,,"Voice & Data.

C.C.T.V systems",Electrician,s3://attachments.broadbean.com/260889687
301929727,"Debbie Phillips",magneta77@icloud.com,2019-09-09T08:58:13,eden_brown_charities,,,,,,"Not for Profit and Charities",Temporary,,,"NatWest Bank","Customer Accounts Administrator",s3://attachments.broadbean.com/301929727
302002113,"Peter Unwin",petegunwin@outlook.com,2019-09-09T15:21:11,cvlibrary,":, Image, NG19 7QW",Nottinghamshire,"NG19 7QW","0774 511 6764",,,,,,Unemployed,,s3://attachments.broadbean.com/302002113
301998607,"Paul Drabarek",pauldrabarek@hotmail.com,2019-09-09T15:04:33,cvlibrary,"157 SEARBY ROAD, SUTTON IN ASHFIELD, NOTTINGHAMSHIRE",,,"0788 992 0637",,,,,,"SUPPLY CARETAKER",,s3://attachments.broadbean.com/301998607
302000903,"Dave Wallis",dave3859@btinternet.com,2019-09-09T15:19:41,cvlibrary,"School, Abbots Bromley",,,"0756 225 5291",,,,,,"Abbots Bromley School","Site Manager",s3://attachments.broadbean.com/302000903
302269759,"Paulo Chagas",paulo_h_chagas@hotmail.com,2019-09-11T05:46:03,gojobsite,"69 Laid House, Redcar Street, London",,,,,Engineering,Contract,,,"Fast UK Ltd","Driver Assistant",s3://attachments.broadbean.com/302269759
265159807,"Mohammad Akhand",mtiakhand@gmail.com,2019-09-11T06:08:00,reed,,,,"0792 273 7766","0792 273 7766",Engineering,Contract,,,"Test and Inspecton Electrician/ Electro Mcenlyre",Chef,s3://attachments.broadbean.com/265159807
298160603,"Amez Sulaiman",amez95kh@gmail.com,2019-09-11T17:48:54,cvlibrary,"Image, Yorkshire, LS4 2QD","West Yorkshire","LS4 2QD","0787 120 5401",,"Not for Profit and Charities",Contract,,,"Chancery West Law limited",librarian,s3://attachments.broadbean.com/298160603
302384921,"Clodagh M",clo_ryan@yahoo.co.uk,2019-09-11T18:02:55,cvlibrary,,,,,,"Admin and Secretarial",Contract,,,"Buckingham Group Contracting Ltd/Brentford Community New Build Stadium","Office Manager",s3://attachments.broadbean.com/302384921
246939767,"sue truss",cinders1907@yahoo.co.uk,2019-09-11T17:08:28,gojobsite,"44 Farnham Close, Crawley, RH11 9RA","West Sussex","RH11 9RA","0791 893 6730",,"Call Centre and Customer Service",Permanent,,,"SHW Partnership LLP","Property Management Assistant",s3://attachments.broadbean.com/246939767
302383471,"Carol Foster",fosterc@hotmail.co.uk,2019-09-11T17:49:49,cvlibrary,"Carol Foster, 9 Spawell Close, Image, WA3 2TF",Cheshire,"WA3 2TF","0777 377 0089","0194 272 0320",,,,,SPIE,"Labour Controller",s3://attachments.broadbean.com/302383471
302381049,"Matthew Cole",m.cole1080@gmail.com,2019-09-11T17:30:43,cvlibrary,":, Image, SO31 6TY",Hampshire,"SO31 6TY","0754 853 4472",,,,,,"Handyman For A.T.Jones",,s3://attachments.broadbean.com/302381049
302450565,"James Donaldson",don14_87@yahoo.co.uk,2019-09-12T06:37:58,cvlibrary,,,,"0780 794 7185","0137 548 3002","Call Centre and Customer Service",Permanent,,,"Eddie Stobart","Logistics Coordinator",s3://attachments.broadbean.com/302450565
302455403,"Aisha Oloko",aisha_oloko@hotmail.co.uk,2019-09-12T07:15:09,cvlibrary,", Eltham, London",,,"0793 512 5713",,"Admin and Secretarial",Permanent,,,,"Project Support",s3://attachments.broadbean.com/302455403
302462945,"Arthur Malone",arthur.malone@live.co.uk,2019-09-12T08:15:11,gojobsite,":, 07977",,07977,,,,,,,"Cigna Financial","SC Cleared Project Manager",s3://attachments.broadbean.com/302462945
302462919,"Siham Rhirhay",siham.rhirhay@gmail.com,2019-09-12T08:14:59,gojobsite,"1 Swinton Vale, Rake Lane, Manchester, M27 8BN","Greater Manchester","M27 8BN","0793 106 9367",,"Building and Construction",Permanent,,,"Valtris Specialty Chemicals","Client support coordinator/ Biocides production planner",s3://attachments.broadbean.com/302462919
302457939,"Gary Stanton",G.Stanton@bham.ac.uk,2019-09-12T07:35:57,cvlibrary,"64 Rigby Lane, Aston Fields, B60 2EW",Worcestershire,"B60 2EW","0740 310 8945",,,,,,"University of Birmingham",holder,s3://attachments.broadbean.com/302457939
302024713,"Raghda Eltaher",raghdaeltaher85@gmail.com,2019-09-11T18:15:35,gojobsite,"21A ElObour Buildings, Heliopolis",,,"+20 100 356 3654",,"Building and Construction",Permanent,,,"Architix Architects Company","Architectural designer",s3://attachments.broadbean.com/302024713
302396231,"Joanna Zieminska",zieminska.joanna@yahoo.pl,2019-09-11T19:36:58,cvlibrary,"[, Image, HA 87 JZ",London,"HA 87 JZ","0780 280 2420",,"Admin and Secretarial",Permanent,,,"Mar-Dam Construction Ltd","Administrative Assistant",s3://attachments.broadbean.com/302396231
302393361,"Sibyl Miranda",leansybil@hotmail.com,2019-09-11T19:13:18,gojobsite,", Watford, WD23 2NA",Hertfordshire,"WD23 2NA","0744 858 1957",,Engineering,Contract,,,,"PROJECT HIGHLIGHTS",s3://attachments.broadbean.com/302393361
302473465,"Anastasia Pirnau",anastasiapirnau@mail.ru,2019-09-12T09:22:53,reed,,,,"0790 431 5970",,"Building and Construction",Permanent,,,"Vejle Boldklub FC",,s3://attachments.broadbean.com/302473465
302490033,"Robert Griffiths",mud_nut@hotmail.com,2019-09-12T11:01:42,gojobsite,,,,"0796 009 5035",,Engineering,Permanent,,,"Johnsons Controls","Site Manager",s3://attachments.broadbean.com/302490033
302489641,"paul mayne",regus1@live.com,2019-09-12T10:59:20,gojobsite,"7 Town Farm Close, Kirkbymoorside, YO62 6AU","North Yorkshire","YO62 6AU","0789 178 0513",,,,,,"Faith Shoes",,s3://attachments.broadbean.com/302489641
302859235,"Andrew Burt",and2409@yahoo.co.uk,2019-09-15T18:06:31,gojobsite,"43 Ramillies Close, Chatham, Kent, ME5 7SA",Kent,"ME5 7SA","0771 945 3523",,Engineering,Permanent,,,"Apleona HSG Ltd","Building Services Engineer",s3://attachments.broadbean.com/302859235
302841223,"Harley Houghton",harleyhoughton091@gmail.com,2019-09-15T15:09:56,gojobsite,", DY5 2XJ","West Midlands","DY5 2XJ","44 795 865 7523",,"Building and Construction",Contract,,,,,s3://attachments.broadbean.com/302841223
302822695,"William Fisher",billfisher1968@gmail.com,2019-09-15T11:26:43,gojobsite,"143b Queens Drive, Newton, WA12 0LN",Merseyside,"WA12 0LN","0782 185 3891",,"Building and Construction",Contract,,,,,s3://attachments.broadbean.com/302822695
302919815,"William Jack Sharpe",jacksharpe81@hotmail.co.uk,2019-09-16T08:04:54,gojobsite,"16 Longstone road, Chippenham, SN14 OJX",Wiltshire,"SN14 OJX","0750 527 0172","0124 924 8925","Building and Construction",Permanent,,,"Greensquare housing association","Maintenance Supervisor",s3://attachments.broadbean.com/302919815
298688201,"Paul Phelps",paul.phelps3@googlemail.com,2019-09-16T07:48:13,eden_brown_built_environment,", Bitterne",,,"0790 187 4435",,Engineering,Permanent,,,"Associated British Ports","Maintenance team leader",s3://attachments.broadbean.com/298688201
302610651,"Roy Nolan",roynolan1969@gmail.com,2019-09-16T05:26:50,gojobsite,"2 Hyperion Drive, Rochester, Kent, ME2 3RG",Kent,"ME2 3RG","0781 701 7621","0163 472 3050",Engineering,Permanent,,,"Leeds Castle","Maintenance Technician",s3://attachments.broadbean.com/302610651
302902275,"Yohan Lokuhewage",yohanlokuhewage@gmail.com,2019-09-16T05:14:53,gojobsite,"[, Image",,,,"2017 2108","Building and Construction",Permanent,,,"Sri Lanka",,s3://attachments.broadbean.com/302902275
302857153,"Maciej Gomolka",anna.ksiazczak@gmail.com,2019-09-15T17:43:39,cvlibrary,"Image, L26 9UP",Merseyside,"L26 9UP","0784 004 5607",,"Building and Construction",Contract,,,"Ferguson Cleaning Services","Window Cleaner",s3://attachments.broadbean.com/302857153
303152771,"Andrew Glover",andrew290493@hotmail.co.uk,2019-09-17T10:41:40,gojobsite,"34 Thorn Road, Swinton, M27 5QT","Greater Manchester","M27 5QT","0771 261 1986",,"Admin and Secretarial",Permanent,,,,"Administrator; Perren Consultants",s3://attachments.broadbean.com/303152771
303115763,"Adam Yates",agy88@outlook.com,2019-09-17T08:00:32,cvlibrary,"Image, PO35EN",Hampshire,PO35EN,"44 782 521 4640",,Engineering,Permanent,,,"Riptide South LTD",,s3://attachments.broadbean.com/303115763
303164497,"Tanvi Lapalikar",tanvilapalikar@gmail.com,2019-09-17T11:46:05,gojobsite,"8 Portland Street, Nottingham, NG9",,,"+44 7493 516214",,"Building and Construction",Permanent,,,"Prashant Deshmukh And Associates",Intern,s3://attachments.broadbean.com/303164497
303169417,"Graham Barlow",grahambarlow759@btinternet.com,2019-09-17T12:14:07,reed,"Rev 21 cv 190818, Cottage, PL30 5EN",Cornwall,"PL30 5EN","0776 777 0083","0172 685 2714",,,,,Oktra,"Site Manager",s3://attachments.broadbean.com/303169417
303174983,"Julia Roper",juliaroper1@yahoo.co.uk,2019-09-17T12:47:16,reed,"246 College Road, Sandhurst, Berkshire, GU47 0RJ",Berkshire,"GU47 0RJ","0753 834 1001","012 763 5686",,,,,"Hyster-Yale Group",Receptionist/Administrator,s3://attachments.broadbean.com/303174983
303175271,"Simon Wells",simonmatthewwells@googlemail.com,2019-09-17T12:48:45,cvlibrary,"30 Fletcher Street, Heanor, Derbyshire, DE75 7PE",Derbyshire,"DE75 7PE","0797 052 1603","0177 371 8097",,,,,Unichem,"Line Operator",s3://attachments.broadbean.com/303175271
298494665,"Sujani Perera",sujanisepalika@gmail.com,2019-09-16T03:52:47,reed,"Holy Cross",,,"9477 596 5515",,"Building and Construction",Permanent,,,"Setmil Interior Solutions (Pvt) Ltd","Interior Designer",s3://attachments.broadbean.com/298494665
302836879,"Robert Moloney",rojomo02@live.co.uk,2019-09-17T08:59:57,cvlibrary,"40a High Street, Kingswood, BAM, BS15 4AJ",Bristol,"BS15 4AJ","0748 229 0559",,Engineering,Temporary,,,"BAM FM",caretaker,s3://attachments.broadbean.com/302836879
303132547,"Andrew Dominguez",andrewdominguez2016@hotmail.com,2019-09-17T09:12:15,gojobsite,,,,"0798 264 9935",,Engineering,Permanent,,,,"M&E Manager",s3://attachments.broadbean.com/303132547
303112551,"Gareth Boyle",gbhomeimprovements@live.com,2019-09-17T07:38:39,reed,"65 Palmerston Road, Earlsdon, CV5 6fh","West Midlands","CV5 6fh","0756 281 6939",,,,,,"National express bus","Bus driver",s3://attachments.broadbean.com/303112551
303108581,"Christopher Wright",cswwright@gmail.com,2019-09-17T07:11:42,reed,"18 Saint Matthew\'s Road, Able, NP4 5JZ",Tor-faen,"NP4 5JZ","0787 779 2043","0149 574 0132","Building and Construction",Permanent,,,"CarpenterCA Lawrence",,s3://attachments.broadbean.com/303108581